tez-dev mailing list archives

Site index · List index
Message view « Date » · « Thread »
Top « Date » · « Thread »
From "Jianfeng (Jeff) Zhang" <jzh...@hortonworks.com>
Subject Re: Build failed in Jenkins: Tez-Build-Hadoop-2.2 #67
Date Thu, 09 Apr 2015 02:52:16 GMT

Look like build failed due to environment issue. The test case fails due
to 

2015-04-09 01:10:47,050 ERROR [AsyncDispatcher event handler]
resourcemanager.ResourceManager (ResourceManager.java:handle(510)) - Error
in handling event type APP_SAVED for application
application_1428541301613_0008
java.lang.NoSuchMethodError:
org.apache.hadoop.yarn.server.webproxy.ProxyUriUtils.getUriFromAMUrl(Ljava/
lang/String;)Ljava/net/URI;
	at 
org.apache.hadoop.yarn.server.resourcemanager.rmapp.attempt.RMAppAttemptImp
l.generateProxyUriWithoutScheme(RMAppAttemptImpl.java:484)
	at 
org.apache.hadoop.yarn.server.resourcemanager.rmapp.attempt.RMAppAttemptImp
l.generateProxyUriWithoutScheme(RMAppAttemptImpl.java:474)
	at 
org.apache.hadoop.yarn.server.resourcemanager.rmapp.attempt.RMAppAttemptImp
l.<init>(RMAppAttemptImpl.java:384)
	at 
org.apache.hadoop.yarn.server.resourcemanager.rmapp.RMAppImpl.createNewAtte
mpt(RMAppImpl.java:603)
	at 
org.apache.hadoop.yarn.server.resourcemanager.rmapp.RMAppImpl.access$1300(R
MAppImpl.java:79)
	at 
org.apache.hadoop.yarn.server.resourcemanager.rmapp.RMAppImpl$StartAppAttem
ptTransition.transition(RMAppImpl.java:651)
	at 
org.apache.hadoop.yarn.server.resourcemanager.rmapp.RMAppImpl$StartAppAttem
ptTransition.transition(RMAppImpl.java:636)
	at 
org.apache.hadoop.yarn.state.StateMachineFactory$SingleInternalArc.doTransi
tion(StateMachineFactory.java:362)
	at 
org.apache.hadoop.yarn.state.StateMachineFactory.doTransition(StateMachineF
actory.java:302)
	at 
org.apache.hadoop.yarn.state.StateMachineFactory.access$300(StateMachineFac
tory.java:46)
	at 
org.apache.hadoop.yarn.state.StateMachineFactory$InternalStateMachine.doTra
nsition(StateMachineFactory.java:448)
	at 
org.apache.hadoop.yarn.server.resourcemanager.rmapp.RMAppImpl.handle(RMAppI
mpl.java:571)
	at 
org.apache.hadoop.yarn.server.resourcemanager.rmapp.RMAppImpl.handle(RMAppI
mpl.java:79)
	at 
org.apache.hadoop.yarn.server.resourcemanager.ResourceManager$ApplicationEv
entDispatcher.handle(ResourceManager.java:508)
	at 
org.apache.hadoop.yarn.server.resourcemanager.ResourceManager$ApplicationEv
entDispatcher.handle(ResourceManager.java:492)
	at 
org.apache.hadoop.yarn.event.AsyncDispatcher.dispatch(AsyncDispatcher.java:
134)
	at 
org.apache.hadoop.yarn.event.AsyncDispatcher$1.run(AsyncDispatcher.java:81)
	at java.lang.Thread.run(Thread.java:662)



Best Regard,
Jeff Zhang





On 4/9/15, 9:54 AM, "Apache Jenkins Server" <jenkins@builds.apache.org>
wrote:

>See <https://builds.apache.org/job/Tez-Build-Hadoop-2.2/67/changes>
>
>Changes:
>
>[zjffdu] TEZ-1909. Remove need to copy over all events from attempt 1 to
>attempt 2 dir (zjffdu)
>
>[pramachandran] TEZ-2273. Tez UI: Support client side searching & sorting
>for dag tasks page (Sreenath Somarajapuram via pramachandran)
>
>[hitesh] TEZ-2293. When running in "mr" mode, always use MR config
>settings. (hitesh)
>
>[bikas] TEZ-2233. Allow EdgeProperty of an edge to be changed by
>VertexManager (bikas)
>
>------------------------------------------
>[...truncated 2200 lines...]
>     
>?[32m'.tmp/bower_components/jquery-ui/themes/smoothness/jquery-ui.css'?[39
>m ],
>  ?[32m'dist/scripts/components.js'?[39m:
>   [ ?[32m'app/bower_components/jquery/jquery.js'?[39m,
>     ?[32m'app/bower_components/jquery-ui/jquery-ui.js'?[39m,
>     ?[32m'app/bower_components/bootstrap/js/dropdown.js'?[39m,
>     ?[32m'app/bower_components/bootstrap/js/button.js'?[39m,
>     ?[32m'app/bower_components/bootstrap/js/tooltip.js'?[39m,
>     ?[32m'app/bower_components/jquery-ui/ui/datepicker.js'?[39m,
>     ?[32m'app/bower_components/moment/moment.js'?[39m,
>     ?[32m'app/bower_components/handlebars/handlebars.js'?[39m,
>     ?[32m'app/bower_components/ember/ember.js'?[39m,
>     ?[32m'app/bower_components/ember-data/ember-data.js'?[39m,
>     
>?[32m'app/bower_components/ember-json-mapper/ember-json-mapper.js'?[39m,
>     ?[32m'app/bower_components/ember-i18n/lib/i18n.js'?[39m,
>     
>?[32m'app/bower_components/ember-addons.bs_for_ember/dist/js/bs-core.min.j
>s'?[39m,
>     
>?[32m'app/bower_components/ember-addons.bs_for_ember/dist/js/bs-basic.min.
>js'?[39m,
>     
>?[32m'app/bower_components/ember-addons.bs_for_ember/dist/js/bs-button.min
>.js'?[39m,
>     
>?[32m'app/bower_components/ember-addons.bs_for_ember/dist/js/bs-modal.min.
>js'?[39m,
>     
>?[32m'app/bower_components/ember-addons.bs_for_ember/dist/js/bs-nav.min.js
>'?[39m,
>     
>?[32m'app/bower_components/ember-addons.bs_for_ember/dist/js/bs-items-acti
>on-bar.min.js'?[39m,
>     
>?[32m'app/bower_components/ember-addons.bs_for_ember/dist/js/bs-badge.min.
>js'?[39m,
>     
>?[32m'app/bower_components/ember-addons.bs_for_ember/dist/js/bs-label.min.
>js'?[39m,
>     ?[32m'app/bower_components/antiscroll/antiscroll.js'?[39m,
>     
>?[32m'app/bower_components/jquery-mousewheel/jquery.mousewheel.js'?[39m,
>     ?[32m'app/bower_components/ember-table/dist/ember-table.js'?[39m,
>     
>?[32m'app/bower_components/ember-addons.bs_for_ember/dist/js/bs-nav.min.js
>'?[39m,
>     ?[32m'app/bower_components/d3/d3.js'?[39m,
>     ?[32m'app/bower_components/zip.js/WebContent/zip.js'?[39m,
>     ?[32m'app/bower_components/FileSaver.js/FileSaver.min.js'?[39m ],
>  ?[32m'dist/scripts/templates.js'?[39m: [
>?[32m'.tmp/scripts/compiled-templates.js'?[39m ],
>  ?[32m'dist/scripts/main.js'?[39m: [
>?[32m'.tmp/scripts/combined-scripts.js'?[39m ] }
>
>?[1m  uglify:?[22m
>  { ?[32m'dist/scripts/components.js'?[39m:
>?[32m'dist/scripts/components.js'?[39m,
>  ?[32m'dist/scripts/templates.js'?[39m:
>?[32m'dist/scripts/templates.js'?[39m,
>  ?[32m'dist/scripts/main.js'?[39m: ?[32m'dist/scripts/main.js'?[39m }
>
>?[1m  requirejs:?[22m
>  {}
>
>?[4mRunning "concurrent:dist" (concurrent) task?[24m
>    
>    ?[4mRunning "htmlmin:dist" (htmlmin) task?[24m
>    File dist/index.html created.
>    
>    ?[32mDone, without errors.?[39m
>        
>    ?[4mRunning "svgmin:dist" (svgmin) task?[24m
>    
>    ?[32mDone, without errors.?[39m
>        
>    ?[4mRunning "emberTemplates:dist" (emberTemplates) task?[24m
>    File ".tmp/scripts/compiled-templates.js" created.
>    
>    ?[4mRunning "emberTemplates:development" (emberTemplates) task?[24m
>    File ".tmp/scripts/compiled-templates.js" created.
>    
>    ?[32mDone, without errors.?[39m
>    
>?[4mRunning "neuter:app" (neuter) task?[24m
>
>?[4mRunning "less:production" (less) task?[24m
>File .tmp/styles/styles.css created: 378.37 kB → 309.8 kB
>
>?[4mRunning "concat:dist/styles/main.css" (concat) task?[24m
>File "dist/styles/main.css" created.
>
>?[4mRunning "concat:dist/scripts/components.js" (concat) task?[24m
>File "dist/scripts/components.js" created.
>
>?[4mRunning "concat:dist/scripts/templates.js" (concat) task?[24m
>File "dist/scripts/templates.js" created.
>
>?[4mRunning "concat:dist/scripts/main.js" (concat) task?[24m
>File "dist/scripts/main.js" created.
>
>?[4mRunning "cssmin:dist" (cssmin) task?[24m
>File dist/styles/main.css created.
>
>?[4mRunning "cssmin:dist/styles/main.css" (cssmin) task?[24m
>File dist/styles/main.css created.
>
>?[4mRunning "copy:dist" (copy) task?[24m
>Copied ?[36m27?[39m files
>
>?[4mRunning "usemin:html" (usemin) task?[24m
>
>?[1mProcessing as HTML - dist/index.html?[22m
>Update the HTML to reference our concat/min/revved script files
>Update the HTML with the new css filenames
>Update the HTML with the new img filenames
>Update the HTML with data-main tags
>Update the HTML with the data tags
>Update the HTML with background imgs, case there is some inline style
>Update the HTML with anchors images
>Update the HTML with reference in input
>
>?[4mRunning "usemin:css" (usemin) task?[24m
>
>?[1mProcessing as CSS - dist/styles/main.css?[22m
>Update the CSS with new img filenames
>
>?[32mDone, without errors.?[39m
>[INFO] 
>[INFO] --- maven-resources-plugin:2.6:resources (default-resources) @
>tez-ui ---
>[INFO] Using 'UTF-8' encoding to copy filtered resources.
>[INFO] Copying 2 resources
>[INFO] 
>[INFO] --- maven-compiler-plugin:3.1:compile (default-compile) @ tez-ui
>---
>[INFO] No sources to compile
>[INFO] 
>[INFO] --- maven-resources-plugin:2.6:testResources
>(default-testResources) @ tez-ui ---
>[INFO] Using 'UTF-8' encoding to copy filtered resources.
>[INFO] skip non existing resourceDirectory
><https://builds.apache.org/job/Tez-Build-Hadoop-2.2/ws/tez-ui/src/test/res
>ources>
>[INFO] 
>[INFO] --- maven-compiler-plugin:3.1:testCompile (default-testCompile) @
>tez-ui ---
>[INFO] No sources to compile
>[INFO] 
>[INFO] --- maven-surefire-plugin:2.14.1:test (default-test) @ tez-ui ---
>[INFO] No tests to run.
>[INFO]            
>     
>[INFO] 
>------------------------------------------------------------------------
>[INFO] Building tez-plugins 0.7.0-SNAPSHOT
>[INFO] 
>------------------------------------------------------------------------
>[INFO] 
>[INFO] --- maven-clean-plugin:2.5:clean (default-clean) @ tez-plugins ---
>[INFO] 
>[INFO] --- buildnumber-maven-plugin:1.1:create (default) @ tez-plugins ---
>[INFO] Checking for local modifications: skipped.
>[INFO] Updating project files from SCM: skipped.
>[INFO] Executing: /bin/sh -c cd
><https://builds.apache.org/job/Tez-Build-Hadoop-2.2/ws/tez-plugins> &&
>git rev-parse --verify HEAD
>[INFO] Working directory:
><https://builds.apache.org/job/Tez-Build-Hadoop-2.2/ws/tez-plugins>
>[INFO] Storing buildNumber: c636dc2206a1f3a9261b923a0e02ade0d23a19ec at
>timestamp: 1428544457058
>[INFO] Executing: /bin/sh -c cd
><https://builds.apache.org/job/Tez-Build-Hadoop-2.2/ws/tez-plugins> &&
>git rev-parse --verify HEAD
>[INFO] Working directory:
><https://builds.apache.org/job/Tez-Build-Hadoop-2.2/ws/tez-plugins>
>[INFO] Storing buildScmBranch: UNKNOWN
>[INFO] 
>[INFO] --- build-helper-maven-plugin:1.8:maven-version (maven-version) @
>tez-plugins ---
>[INFO]            
>     
>[INFO] 
>------------------------------------------------------------------------
>[INFO] Building tez-mbeans-resource-calculator 0.7.0-SNAPSHOT
>[INFO] 
>------------------------------------------------------------------------
>[INFO] 
>[INFO] --- maven-clean-plugin:2.5:clean (default-clean) @
>tez-mbeans-resource-calculator ---
>[INFO] 
>[INFO] --- buildnumber-maven-plugin:1.1:create (default) @
>tez-mbeans-resource-calculator ---
>[INFO] Checking for local modifications: skipped.
>[INFO] Updating project files from SCM: skipped.
>[INFO] Executing: /bin/sh -c cd
><https://builds.apache.org/job/Tez-Build-Hadoop-2.2/ws/tez-plugins/tez-mbe
>ans-resource-calculator> && git rev-parse --verify HEAD
>[INFO] Working directory:
><https://builds.apache.org/job/Tez-Build-Hadoop-2.2/ws/tez-plugins/tez-mbe
>ans-resource-calculator>
>[INFO] Storing buildNumber: c636dc2206a1f3a9261b923a0e02ade0d23a19ec at
>timestamp: 1428544457129
>[INFO] Executing: /bin/sh -c cd
><https://builds.apache.org/job/Tez-Build-Hadoop-2.2/ws/tez-plugins/tez-mbe
>ans-resource-calculator> && git rev-parse --verify HEAD
>[INFO] Working directory:
><https://builds.apache.org/job/Tez-Build-Hadoop-2.2/ws/tez-plugins/tez-mbe
>ans-resource-calculator>
>[INFO] Storing buildScmBranch: UNKNOWN
>[INFO] 
>[INFO] --- build-helper-maven-plugin:1.8:maven-version (maven-version) @
>tez-mbeans-resource-calculator ---
>[INFO] 
>[INFO] --- maven-resources-plugin:2.6:resources (default-resources) @
>tez-mbeans-resource-calculator ---
>[INFO] Using 'UTF-8' encoding to copy filtered resources.
>[INFO] skip non existing resourceDirectory
><https://builds.apache.org/job/Tez-Build-Hadoop-2.2/ws/tez-plugins/tez-mbe
>ans-resource-calculator/src/main/resources>
>[INFO] 
>[INFO] --- maven-compiler-plugin:3.1:compile (default-compile) @
>tez-mbeans-resource-calculator ---
>[INFO] Changes detected - recompiling the module!
>[INFO] Compiling 1 source file to
><https://builds.apache.org/job/Tez-Build-Hadoop-2.2/ws/tez-plugins/tez-mbe
>ans-resource-calculator/target/classes>
>[INFO] 
>[INFO] --- maven-resources-plugin:2.6:testResources
>(default-testResources) @ tez-mbeans-resource-calculator ---
>[INFO] Using 'UTF-8' encoding to copy filtered resources.
>[INFO] skip non existing resourceDirectory
><https://builds.apache.org/job/Tez-Build-Hadoop-2.2/ws/tez-plugins/tez-mbe
>ans-resource-calculator/src/test/resources>
>[INFO] 
>[INFO] --- maven-compiler-plugin:3.1:testCompile (default-testCompile) @
>tez-mbeans-resource-calculator ---
>[INFO] Changes detected - recompiling the module!
>[INFO] Compiling 1 source file to
><https://builds.apache.org/job/Tez-Build-Hadoop-2.2/ws/tez-plugins/tez-mbe
>ans-resource-calculator/target/test-classes>
>[INFO] 
>[INFO] --- maven-surefire-plugin:2.14.1:test (default-test) @
>tez-mbeans-resource-calculator ---
>[INFO] Surefire report directory:
><https://builds.apache.org/job/Tez-Build-Hadoop-2.2/ws/tez-plugins/tez-mbe
>ans-resource-calculator/target/surefire-reports>
>
>-------------------------------------------------------
> T E S T S
>-------------------------------------------------------
>
>-------------------------------------------------------
> T E S T S
>-------------------------------------------------------
>Running org.apache.tez.util.TestTezMxBeanResourceCalculator
>Tests run: 1, Failures: 0, Errors: 0, Skipped: 0, Time elapsed: 0.34 sec
>
>Results :
>
>Tests run: 1, Failures: 0, Errors: 0, Skipped: 0
>
>[INFO]            
>     
>[INFO] 
>------------------------------------------------------------------------
>[INFO] Skipping tez-dist
>[INFO] This project has been banned from the build due to previous
>failures.
>[INFO] 
>------------------------------------------------------------------------
>[INFO]            
>     
>[INFO] 
>------------------------------------------------------------------------
>[INFO] Building Tez 0.7.0-SNAPSHOT
>[INFO] 
>------------------------------------------------------------------------
>[INFO] 
>[INFO] --- maven-clean-plugin:2.5:clean (default-clean) @ tez-docs ---
>[INFO] 
>[INFO] --- buildnumber-maven-plugin:1.1:create (default) @ tez-docs ---
>[INFO] Checking for local modifications: skipped.
>[INFO] Updating project files from SCM: skipped.
>[INFO] Executing: /bin/sh -c cd
><https://builds.apache.org/job/Tez-Build-Hadoop-2.2/ws/docs> && git
>rev-parse --verify HEAD
>[INFO] Working directory:
><https://builds.apache.org/job/Tez-Build-Hadoop-2.2/ws/docs>
>[INFO] Storing buildNumber: c636dc2206a1f3a9261b923a0e02ade0d23a19ec at
>timestamp: 1428544457841
>[INFO] Executing: /bin/sh -c cd
><https://builds.apache.org/job/Tez-Build-Hadoop-2.2/ws/docs> && git
>rev-parse --verify HEAD
>[INFO] Working directory:
><https://builds.apache.org/job/Tez-Build-Hadoop-2.2/ws/docs>
>[INFO] Storing buildScmBranch: UNKNOWN
>[INFO] 
>[INFO] --- build-helper-maven-plugin:1.8:maven-version (maven-version) @
>tez-docs ---
>[INFO] 
>------------------------------------------------------------------------
>[INFO] Reactor Summary:
>[INFO] 
>[INFO] tez ............................................... SUCCESS [
>0.781 s]
>[INFO] tez-api ........................................... SUCCESS [
>34.177 s]
>[INFO] tez-common ........................................ SUCCESS [
>2.323 s]
>[INFO] tez-runtime-internals ............................. SUCCESS [
>9.621 s]
>[INFO] tez-runtime-library ............................... SUCCESS [01:02
>min]
>[INFO] tez-mapreduce ..................................... SUCCESS [
>21.624 s]
>[INFO] tez-examples ...................................... SUCCESS [
>0.224 s]
>[INFO] tez-dag ........................................... SUCCESS [01:47
>min]
>[INFO] tez-tests ......................................... FAILURE [
>01:46 h]
>[INFO] tez-ui ............................................ SUCCESS [
>43.323 s]
>[INFO] tez-plugins ....................................... SUCCESS [
>0.015 s]
>[INFO] tez-mbeans-resource-calculator .................... SUCCESS [
>0.766 s]
>[INFO] tez-dist .......................................... SKIPPED
>[INFO] Tez ............................................... SUCCESS [
>0.017 s]
>[INFO] 
>------------------------------------------------------------------------
>[INFO] BUILD FAILURE
>[INFO] 
>------------------------------------------------------------------------
>[INFO] Total time: 01:51 h
>[INFO] Finished at: 2015-04-09T01:54:17+00:00
>[INFO] Final Memory: 61M/786M
>[INFO] 
>------------------------------------------------------------------------
>[ERROR] Failed to execute goal
>org.apache.maven.plugins:maven-surefire-plugin:2.14.1:test (default-test)
>on project tez-tests: There was a timeout or other error in the fork ->
>[Help 1]
>[ERROR] 
>[ERROR] To see the full stack trace of the errors, re-run Maven with the
>-e switch.
>[ERROR] Re-run Maven using the -X switch to enable full debug logging.
>[ERROR] 
>[ERROR] For more information about the errors and possible solutions,
>please read the following articles:
>[ERROR] [Help 1] 
>http://cwiki.apache.org/confluence/display/MAVEN/MojoFailureException
>[ERROR] 
>[ERROR] After correcting the problems, you can resume the build with the
>command
>[ERROR]   mvn <goals> -rf :tez-tests
>Build step 'Execute shell' marked build as failure
>Recording test results


Mime
View raw message