tez-dev mailing list archives

Site index · List index
Message view « Date » · « Thread »
Top « Date » · « Thread »
From Apache Jenkins Server <jenk...@builds.apache.org>
Subject Build failed in Jenkins: Tez-Build-branch-tez-2003 #2
Date Tue, 02 Jun 2015 03:25:59 GMT
See <https://builds.apache.org/job/Tez-Build-branch-tez-2003/2/>

------------------------------------------
[...truncated 1736 lines...]
[INFO] Executing: /bin/sh -c cd <https://builds.apache.org/job/Tez-Build-branch-tez-2003/ws/tez-ext-service-tests>
&& git rev-parse --verify HEAD
[INFO] Working directory: <https://builds.apache.org/job/Tez-Build-branch-tez-2003/ws/tez-ext-service-tests>
[INFO] Storing buildNumber: 5738104e4745f507cb27319d7b15ea4015cec138 at timestamp: 1433215557593
[INFO] Executing: /bin/sh -c cd <https://builds.apache.org/job/Tez-Build-branch-tez-2003/ws/tez-ext-service-tests>
&& git rev-parse --verify HEAD
[INFO] Working directory: <https://builds.apache.org/job/Tez-Build-branch-tez-2003/ws/tez-ext-service-tests>
[INFO] Storing buildScmBranch: UNKNOWN
[INFO] 
[INFO] --- build-helper-maven-plugin:1.8:maven-version (maven-version) @ tez-ext-service-tests
---
[INFO] 
[INFO] --- hadoop-maven-plugins:2.6.0:protoc (compile-protoc) @ tez-ext-service-tests ---
[INFO] 
[INFO] --- maven-resources-plugin:2.6:resources (default-resources) @ tez-ext-service-tests
---
[INFO] Using 'UTF-8' encoding to copy filtered resources.
[INFO] skip non existing resourceDirectory <https://builds.apache.org/job/Tez-Build-branch-tez-2003/ws/tez-ext-service-tests/src/main/resources>
[INFO] skip non existing resourceDirectory <https://builds.apache.org/job/Tez-Build-branch-tez-2003/ws/tez-ext-service-tests/src/main/resources>
[INFO] 
[INFO] --- maven-compiler-plugin:3.1:compile (default-compile) @ tez-ext-service-tests ---
[INFO] Changes detected - recompiling the module!
[INFO] Compiling 1 source file to <https://builds.apache.org/job/Tez-Build-branch-tez-2003/ws/tez-ext-service-tests/target/classes>
[INFO] 
[INFO] --- maven-resources-plugin:2.6:testResources (default-testResources) @ tez-ext-service-tests
---
[INFO] Using 'UTF-8' encoding to copy filtered resources.
[INFO] Copying 1 resource
[INFO] 
[INFO] --- maven-compiler-plugin:3.1:testCompile (default-testCompile) @ tez-ext-service-tests
---
[INFO] Changes detected - recompiling the module!
[INFO] Compiling 20 source files to <https://builds.apache.org/job/Tez-Build-branch-tez-2003/ws/tez-ext-service-tests/target/test-classes>
[WARNING] <https://builds.apache.org/job/Tez-Build-branch-tez-2003/ws/tez-ext-service-tests/src/test/java/org/apache/tez/dag/app/rm/TezTestServiceTaskSchedulerService.java>:
<https://builds.apache.org/job/Tez-Build-branch-tez-2003/ws/tez-ext-service-tests/src/test/java/org/apache/tez/dag/app/rm/TezTestServiceTaskSchedulerService.java>
uses or overrides a deprecated API.
[WARNING] <https://builds.apache.org/job/Tez-Build-branch-tez-2003/ws/tez-ext-service-tests/src/test/java/org/apache/tez/dag/app/rm/TezTestServiceTaskSchedulerService.java>:
Recompile with -Xlint:deprecation for details.
[WARNING] <https://builds.apache.org/job/Tez-Build-branch-tez-2003/ws/tez-ext-service-tests/src/test/java/org/apache/tez/dag/app/launcher/TezTestServiceNoOpContainerLauncher.java>:
Some input files use unchecked or unsafe operations.
[WARNING] <https://builds.apache.org/job/Tez-Build-branch-tez-2003/ws/tez-ext-service-tests/src/test/java/org/apache/tez/dag/app/launcher/TezTestServiceNoOpContainerLauncher.java>:
Recompile with -Xlint:unchecked for details.
[INFO] 
[INFO] --- maven-surefire-plugin:2.14.1:test (default-test) @ tez-ext-service-tests ---
[INFO] Tests are skipped.
[INFO] 
[INFO] --- buildnumber-maven-plugin:1.1:create (default) @ tez-ext-service-tests ---
[INFO] Checking for local modifications: skipped.
[INFO] Updating project files from SCM: skipped.
[INFO] Executing: /bin/sh -c cd <https://builds.apache.org/job/Tez-Build-branch-tez-2003/ws/tez-ext-service-tests>
&& git rev-parse --verify HEAD
[INFO] Working directory: <https://builds.apache.org/job/Tez-Build-branch-tez-2003/ws/tez-ext-service-tests>
[INFO] Storing buildNumber: 5738104e4745f507cb27319d7b15ea4015cec138 at timestamp: 1433215558026
[INFO] Executing: /bin/sh -c cd <https://builds.apache.org/job/Tez-Build-branch-tez-2003/ws/tez-ext-service-tests>
&& git rev-parse --verify HEAD
[INFO] Working directory: <https://builds.apache.org/job/Tez-Build-branch-tez-2003/ws/tez-ext-service-tests>
[INFO] Storing buildScmBranch: UNKNOWN
[INFO] 
[INFO] --- build-helper-maven-plugin:1.8:maven-version (maven-version) @ tez-ext-service-tests
---
[INFO] 
[INFO] --- hadoop-maven-plugins:2.6.0:protoc (compile-protoc) @ tez-ext-service-tests ---
[INFO] 
[INFO] --- maven-resources-plugin:2.6:resources (default-resources) @ tez-ext-service-tests
---
[INFO] Using 'UTF-8' encoding to copy filtered resources.
[INFO] skip non existing resourceDirectory <https://builds.apache.org/job/Tez-Build-branch-tez-2003/ws/tez-ext-service-tests/src/main/resources>
[INFO] skip non existing resourceDirectory <https://builds.apache.org/job/Tez-Build-branch-tez-2003/ws/tez-ext-service-tests/src/main/resources>
[INFO] 
[INFO] --- maven-compiler-plugin:3.1:compile (default-compile) @ tez-ext-service-tests ---
[INFO] Changes detected - recompiling the module!
[INFO] Compiling 1 source file to <https://builds.apache.org/job/Tez-Build-branch-tez-2003/ws/tez-ext-service-tests/target/classes>
[INFO] 
[INFO] --- maven-resources-plugin:2.6:testResources (default-testResources) @ tez-ext-service-tests
---
[INFO] Using 'UTF-8' encoding to copy filtered resources.
[INFO] Copying 1 resource
[INFO] 
[INFO] --- maven-compiler-plugin:3.1:testCompile (default-testCompile) @ tez-ext-service-tests
---
[INFO] Nothing to compile - all classes are up to date
[INFO] 
[INFO] --- maven-surefire-plugin:2.14.1:test (default-test) @ tez-ext-service-tests ---
[INFO] Tests are skipped.
[INFO] 
[INFO] --- maven-jar-plugin:2.4:jar (default-jar) @ tez-ext-service-tests ---
[INFO] Building jar: <https://builds.apache.org/job/Tez-Build-branch-tez-2003/ws/tez-ext-service-tests/target/tez-ext-service-tests-0.8.0-TEZ-2003-SNAPSHOT.jar>
[INFO] 
[INFO] --- maven-jar-plugin:2.4:test-jar (default) @ tez-ext-service-tests ---
[INFO] Building jar: <https://builds.apache.org/job/Tez-Build-branch-tez-2003/ws/tez-ext-service-tests/target/tez-ext-service-tests-0.8.0-TEZ-2003-SNAPSHOT-tests.jar>
[INFO] 
[INFO] --- maven-install-plugin:2.4:install (default-install) @ tez-ext-service-tests ---
[INFO] Installing <https://builds.apache.org/job/Tez-Build-branch-tez-2003/ws/tez-ext-service-tests/target/tez-ext-service-tests-0.8.0-TEZ-2003-SNAPSHOT.jar>
to /home/jenkins/.m2/repository/org/apache/tez/tez-ext-service-tests/0.8.0-TEZ-2003-SNAPSHOT/tez-ext-service-tests-0.8.0-TEZ-2003-SNAPSHOT.jar
[INFO] Installing <https://builds.apache.org/job/Tez-Build-branch-tez-2003/ws/tez-ext-service-tests/pom.xml>
to /home/jenkins/.m2/repository/org/apache/tez/tez-ext-service-tests/0.8.0-TEZ-2003-SNAPSHOT/tez-ext-service-tests-0.8.0-TEZ-2003-SNAPSHOT.pom
[INFO] Installing <https://builds.apache.org/job/Tez-Build-branch-tez-2003/ws/tez-ext-service-tests/target/tez-ext-service-tests-0.8.0-TEZ-2003-SNAPSHOT-tests.jar>
to /home/jenkins/.m2/repository/org/apache/tez/tez-ext-service-tests/0.8.0-TEZ-2003-SNAPSHOT/tez-ext-service-tests-0.8.0-TEZ-2003-SNAPSHOT-tests.jar
[INFO] 
[INFO] --- maven-deploy-plugin:2.8.1:deploy (default-deploy) @ tez-ext-service-tests ---
[INFO] Deploying org.apache.tez:tez-ext-service-tests:0.8.0-TEZ-2003-SNAPSHOT at end
[INFO] 
[INFO] --- buildnumber-maven-plugin:1.1:create (default) @ tez-ext-service-tests ---
[INFO] Checking for local modifications: skipped.
[INFO] Updating project files from SCM: skipped.
[INFO] Executing: /bin/sh -c cd <https://builds.apache.org/job/Tez-Build-branch-tez-2003/ws/tez-ext-service-tests>
&& git rev-parse --verify HEAD
[INFO] Working directory: <https://builds.apache.org/job/Tez-Build-branch-tez-2003/ws/tez-ext-service-tests>
[INFO] Storing buildNumber: 5738104e4745f507cb27319d7b15ea4015cec138 at timestamp: 1433215558344
[INFO] Executing: /bin/sh -c cd <https://builds.apache.org/job/Tez-Build-branch-tez-2003/ws/tez-ext-service-tests>
&& git rev-parse --verify HEAD
[INFO] Working directory: <https://builds.apache.org/job/Tez-Build-branch-tez-2003/ws/tez-ext-service-tests>
[INFO] Storing buildScmBranch: UNKNOWN
[INFO] 
[INFO] --- build-helper-maven-plugin:1.8:maven-version (maven-version) @ tez-ext-service-tests
---
[INFO] 
[INFO] --- hadoop-maven-plugins:2.6.0:protoc (compile-protoc) @ tez-ext-service-tests ---
[INFO] 
[INFO] --- maven-resources-plugin:2.6:resources (default-resources) @ tez-ext-service-tests
---
[INFO] Using 'UTF-8' encoding to copy filtered resources.
[INFO] skip non existing resourceDirectory <https://builds.apache.org/job/Tez-Build-branch-tez-2003/ws/tez-ext-service-tests/src/main/resources>
[INFO] skip non existing resourceDirectory <https://builds.apache.org/job/Tez-Build-branch-tez-2003/ws/tez-ext-service-tests/src/main/resources>
[INFO] 
[INFO] --- maven-compiler-plugin:3.1:compile (default-compile) @ tez-ext-service-tests ---
[INFO] Nothing to compile - all classes are up to date
[INFO] 
[INFO] --- maven-resources-plugin:2.6:testResources (default-testResources) @ tez-ext-service-tests
---
[INFO] Using 'UTF-8' encoding to copy filtered resources.
[INFO] Copying 1 resource
[INFO] 
[INFO] --- maven-compiler-plugin:3.1:testCompile (default-testCompile) @ tez-ext-service-tests
---
[INFO] Nothing to compile - all classes are up to date
[INFO] 
[INFO] --- maven-surefire-plugin:2.14.1:test (default-test) @ tez-ext-service-tests ---
[INFO] Tests are skipped.
[INFO] 
[INFO] --- maven-jar-plugin:2.4:jar (default-jar) @ tez-ext-service-tests ---
[INFO] 
[INFO] --- maven-jar-plugin:2.4:test-jar (default) @ tez-ext-service-tests ---
[INFO]                                                                         
[INFO] ------------------------------------------------------------------------
[INFO] Building tez-dist 0.8.0-TEZ-2003-SNAPSHOT
[INFO] ------------------------------------------------------------------------
[INFO] 
[INFO] --- maven-clean-plugin:2.5:clean (default-clean) @ tez-dist ---
[INFO] 
[INFO] --- buildnumber-maven-plugin:1.1:create (default) @ tez-dist ---
[INFO] Checking for local modifications: skipped.
[INFO] Updating project files from SCM: skipped.
[INFO] Executing: /bin/sh -c cd <https://builds.apache.org/job/Tez-Build-branch-tez-2003/ws/tez-dist>
&& git rev-parse --verify HEAD
[INFO] Working directory: <https://builds.apache.org/job/Tez-Build-branch-tez-2003/ws/tez-dist>
[INFO] Storing buildNumber: 5738104e4745f507cb27319d7b15ea4015cec138 at timestamp: 1433215558453
[INFO] Executing: /bin/sh -c cd <https://builds.apache.org/job/Tez-Build-branch-tez-2003/ws/tez-dist>
&& git rev-parse --verify HEAD
[INFO] Working directory: <https://builds.apache.org/job/Tez-Build-branch-tez-2003/ws/tez-dist>
[INFO] Storing buildScmBranch: UNKNOWN
[INFO] 
[INFO] --- build-helper-maven-plugin:1.8:maven-version (maven-version) @ tez-dist ---
[INFO] 
[INFO] --- buildnumber-maven-plugin:1.1:create (default) @ tez-dist ---
[INFO] Checking for local modifications: skipped.
[INFO] Updating project files from SCM: skipped.
[INFO] Executing: /bin/sh -c cd <https://builds.apache.org/job/Tez-Build-branch-tez-2003/ws/tez-dist>
&& git rev-parse --verify HEAD
[INFO] Working directory: <https://builds.apache.org/job/Tez-Build-branch-tez-2003/ws/tez-dist>
[INFO] Storing buildNumber: 5738104e4745f507cb27319d7b15ea4015cec138 at timestamp: 1433215558463
[INFO] Executing: /bin/sh -c cd <https://builds.apache.org/job/Tez-Build-branch-tez-2003/ws/tez-dist>
&& git rev-parse --verify HEAD
[INFO] Working directory: <https://builds.apache.org/job/Tez-Build-branch-tez-2003/ws/tez-dist>
[INFO] Storing buildScmBranch: UNKNOWN
[INFO] 
[INFO] --- build-helper-maven-plugin:1.8:maven-version (maven-version) @ tez-dist ---
[INFO] 
[INFO] --- maven-assembly-plugin:2.4:single (package-tez) @ tez-dist ---
[INFO] Reading assembly descriptor: src/main/assembly/tez-dist.xml
[INFO]                                                                         
[INFO] ------------------------------------------------------------------------
[INFO] Building Tez 0.8.0-TEZ-2003-SNAPSHOT
[INFO] ------------------------------------------------------------------------
[INFO] 
[INFO] --- maven-clean-plugin:2.5:clean (default-clean) @ tez-docs ---
[INFO] 
[INFO] --- buildnumber-maven-plugin:1.1:create (default) @ tez-docs ---
[INFO] Checking for local modifications: skipped.
[INFO] Updating project files from SCM: skipped.
[INFO] Executing: /bin/sh -c cd <https://builds.apache.org/job/Tez-Build-branch-tez-2003/ws/docs>
&& git rev-parse --verify HEAD
[INFO] Working directory: <https://builds.apache.org/job/Tez-Build-branch-tez-2003/ws/docs>
[INFO] Storing buildNumber: 5738104e4745f507cb27319d7b15ea4015cec138 at timestamp: 1433215558732
[INFO] Executing: /bin/sh -c cd <https://builds.apache.org/job/Tez-Build-branch-tez-2003/ws/docs>
&& git rev-parse --verify HEAD
[INFO] Working directory: <https://builds.apache.org/job/Tez-Build-branch-tez-2003/ws/docs>
[INFO] Storing buildScmBranch: UNKNOWN
[INFO] 
[INFO] --- build-helper-maven-plugin:1.8:maven-version (maven-version) @ tez-docs ---
[INFO] 
[INFO] --- buildnumber-maven-plugin:1.1:create (default) @ tez-docs ---
[INFO] Checking for local modifications: skipped.
[INFO] Updating project files from SCM: skipped.
[INFO] Executing: /bin/sh -c cd <https://builds.apache.org/job/Tez-Build-branch-tez-2003/ws/docs>
&& git rev-parse --verify HEAD
[INFO] Working directory: <https://builds.apache.org/job/Tez-Build-branch-tez-2003/ws/docs>
[INFO] Storing buildNumber: 5738104e4745f507cb27319d7b15ea4015cec138 at timestamp: 1433215558740
[INFO] Executing: /bin/sh -c cd <https://builds.apache.org/job/Tez-Build-branch-tez-2003/ws/docs>
&& git rev-parse --verify HEAD
[INFO] Working directory: <https://builds.apache.org/job/Tez-Build-branch-tez-2003/ws/docs>
[INFO] Storing buildScmBranch: UNKNOWN
[INFO] 
[INFO] --- build-helper-maven-plugin:1.8:maven-version (maven-version) @ tez-docs ---
[INFO] 
[INFO] --- maven-jar-plugin:2.4:test-jar (default) @ tez-docs ---
[WARNING] JAR will be empty - no content was marked for inclusion!
[INFO] Building jar: <https://builds.apache.org/job/Tez-Build-branch-tez-2003/ws/docs/target/tez-docs-0.8.0-TEZ-2003-SNAPSHOT-tests.jar>
[INFO] 
[INFO] --- maven-install-plugin:2.4:install (default-install) @ tez-docs ---
[INFO] Installing <https://builds.apache.org/job/Tez-Build-branch-tez-2003/ws/docs/pom.xml>
to /home/jenkins/.m2/repository/org/apache/tez/tez-docs/0.8.0-TEZ-2003-SNAPSHOT/tez-docs-0.8.0-TEZ-2003-SNAPSHOT.pom
[INFO] Installing <https://builds.apache.org/job/Tez-Build-branch-tez-2003/ws/docs/target/tez-docs-0.8.0-TEZ-2003-SNAPSHOT-tests.jar>
to /home/jenkins/.m2/repository/org/apache/tez/tez-docs/0.8.0-TEZ-2003-SNAPSHOT/tez-docs-0.8.0-TEZ-2003-SNAPSHOT-tests.jar
[INFO] 
[INFO] --- maven-deploy-plugin:2.8.1:deploy (default-deploy) @ tez-docs ---
[INFO] Skipping artifact deployment
[INFO] 
[INFO] --- buildnumber-maven-plugin:1.1:create (default) @ tez-docs ---
[INFO] Checking for local modifications: skipped.
[INFO] Updating project files from SCM: skipped.
[INFO] Executing: /bin/sh -c cd <https://builds.apache.org/job/Tez-Build-branch-tez-2003/ws/docs>
&& git rev-parse --verify HEAD
[INFO] Working directory: <https://builds.apache.org/job/Tez-Build-branch-tez-2003/ws/docs>
[INFO] Storing buildNumber: 5738104e4745f507cb27319d7b15ea4015cec138 at timestamp: 1433215558768
[INFO] Executing: /bin/sh -c cd <https://builds.apache.org/job/Tez-Build-branch-tez-2003/ws/docs>
&& git rev-parse --verify HEAD
[INFO] Working directory: <https://builds.apache.org/job/Tez-Build-branch-tez-2003/ws/docs>
[INFO] Storing buildScmBranch: UNKNOWN
[INFO] 
[INFO] --- build-helper-maven-plugin:1.8:maven-version (maven-version) @ tez-docs ---
[INFO] 
[INFO] --- maven-jar-plugin:2.4:test-jar (default) @ tez-docs ---
[WARNING] JAR will be empty - no content was marked for inclusion!
[INFO] ------------------------------------------------------------------------
[INFO] Reactor Summary:
[INFO] 
[INFO] tez ............................................... SUCCESS [  1.584 s]
[INFO] tez-api ........................................... SUCCESS [ 13.928 s]
[INFO] tez-common ........................................ SUCCESS [  0.507 s]
[INFO] tez-runtime-internals ............................. SUCCESS [  1.169 s]
[INFO] tez-runtime-library ............................... SUCCESS [  3.234 s]
[INFO] tez-mapreduce ..................................... SUCCESS [  1.558 s]
[INFO] tez-examples ...................................... SUCCESS [  0.325 s]
[INFO] tez-dag ........................................... SUCCESS [  6.631 s]
[INFO] tez-tests ......................................... SUCCESS [  0.837 s]
[INFO] tez-ui ............................................ FAILURE [ 31.646 s]
[INFO] tez-plugins ....................................... SUCCESS [  0.071 s]
[INFO] tez-yarn-timeline-history ......................... SUCCESS [  0.486 s]
[INFO] tez-yarn-timeline-history-with-acls ............... SUCCESS [  0.376 s]
[INFO] tez-history-parser ................................ SUCCESS [ 26.313 s]
[INFO] tez-mbeans-resource-calculator .................... SUCCESS [  0.195 s]
[INFO] tez-tools ......................................... SUCCESS [  0.049 s]
[INFO] tez-ext-service-tests ............................. SUCCESS [  0.870 s]
[INFO] tez-dist .......................................... FAILURE [  0.314 s]
[INFO] Tez ............................................... SUCCESS [  0.050 s]
[INFO] ------------------------------------------------------------------------
[INFO] BUILD FAILURE
[INFO] ------------------------------------------------------------------------
[INFO] Total time: 01:30 min
[INFO] Finished at: 2015-06-02T03:25:58+00:00
[INFO] Final Memory: 98M/1107M
[INFO] ------------------------------------------------------------------------
[ERROR] Failed to execute goal com.github.eirslett:frontend-maven-plugin:0.0.16:install-node-and-npm
(install node and npm) on project tez-ui: Could not download Node.js: Could not download http://nodejs.org/dist/v0.10.18/node-v0.10.18-linux-x64.tar.gz:
Connect to nodejs.org:80 [nodejs.org/165.225.133.150] failed: Connection refused -> [Help
1]
[ERROR] Failed to execute goal org.apache.maven.plugins:maven-assembly-plugin:2.4:single (package-tez)
on project tez-dist: Failed to create assembly: Artifact: org.apache.tez:tez-ui:war:0.8.0-TEZ-2003-SNAPSHOT
(included by module) does not have an artifact with a file. Please ensure the package phase
is run before the assembly is generated. -> [Help 2]
[ERROR] 
[ERROR] To see the full stack trace of the errors, re-run Maven with the -e switch.
[ERROR] Re-run Maven using the -X switch to enable full debug logging.
[ERROR] 
[ERROR] For more information about the errors and possible solutions, please read the following
articles:
[ERROR] [Help 1] http://cwiki.apache.org/confluence/display/MAVEN/MojoFailureException
[ERROR] [Help 2] http://cwiki.apache.org/confluence/display/MAVEN/MojoExecutionException
[ERROR] 
[ERROR] After correcting the problems, you can resume the build with the command
[ERROR]   mvn <goals> -rf :tez-ui
Build step 'Execute shell' marked build as failure
Archiving artifacts

Mime
View raw message