tez-dev mailing list archives

Site index · List index
Message view « Date » · « Thread »
Top « Date » · « Thread »
From "Jianfeng (Jeff) Zhang" <jzh...@hortonworks.com>
Subject Re: Build failed in Jenkins: Tez-Build-branch-0.7 #26
Date Thu, 11 Jun 2015 01:22:51 GMT

The issue happens in branch-0.6 building too.  Maybe because master is
using jdk 1.7 and branch-0.6 & branch-0.7 is still using 1.6


Best Regard,
Jeff Zhang





On 6/11/15, 8:31 AM, "Jianfeng (Jeff) Zhang" <jzhang@hortonworks.com>
wrote:

>-> Failed to execute goal
>org.apache.maven.plugins:maven-deploy-plugin:2.8.1:deploy (default-deploy)
>on project tez-docs: Failed to retrieve remote metadata
>org.apache.tez:tez:0.7.1-SNAPSHOT/maven-metadata.xml: Could not transfer
>metadata org.apache.tez:tez:0.7.1-SNAPSHOT/maven-metadata.xml from/to
>apache.snapshots.https
>(https://repository.apache.org/content/repositories/snapshots):
>java.lang.RuntimeException: Could not generate DH keypair: Prime size must
>be multiple of 64, and can only range from 512 to 1024 (inclusive) ->
>[Help 1]
>
>Probably due to a JDK bug, Trying to look for a solution for it.
>
>http://bugs.java.com/bugdatabase/view_bug.do?bug_id=6521495
>
>
>
>
>Best Regard,
>Jeff Zhang
>
>
>
>
>
>On 6/11/15, 7:49 AM, "Apache Jenkins Server" <jenkins@builds.apache.org>
>wrote:
>
>>See <https://builds.apache.org/job/Tez-Build-branch-0.7/26/changes>
>>
>>Changes:
>>
>>[zjffdu] Update version to 0.7.1-SNPASHOT (zjffdu)
>>
>>------------------------------------------
>>[...truncated 2634 lines...]
>>[WARNING] The following patterns were never triggered in this artifact
>>exclusion filter:
>>o  '*:*:test-jar'
>>
>>[WARNING] The following patterns were never triggered in this artifact
>>exclusion filter:
>>o  '*:*:test-jar'
>>
>>[WARNING] The following patterns were never triggered in this artifact
>>exclusion filter:
>>o  '*:*:test-jar'
>>
>>[WARNING] The following patterns were never triggered in this artifact
>>exclusion filter:
>>o  '*:*:test-jar'
>>
>>[INFO] Building tar:
>><https://builds.apache.org/job/Tez-Build-branch-0.7/26/artifact/tez-dist/
>>t
>>arget/tez-0.7.1-SNAPSHOT-minimal.tar.gz>
>>[INFO] 
>>[INFO] --- maven-jar-plugin:2.4:test-jar (default) @ tez-dist ---
>>[WARNING] JAR will be empty - no content was marked for inclusion!
>>[INFO] Building jar:
>><https://builds.apache.org/job/Tez-Build-branch-0.7/ws/tez-dist/target/te
>>z
>>-dist-0.7.1-SNAPSHOT-tests.jar>
>>[INFO] 
>>[INFO] --- maven-install-plugin:2.4:install (default-install) @ tez-dist
>>---
>>[INFO] Installing
>><https://builds.apache.org/job/Tez-Build-branch-0.7/ws/tez-dist/pom.xml>
>>to 
>>/home/jenkins/.m2/repository/org/apache/tez/tez-dist/0.7.1-SNAPSHOT/tez-d
>>i
>>st-0.7.1-SNAPSHOT.pom
>>[INFO] Installing
>><https://builds.apache.org/job/Tez-Build-branch-0.7/ws/tez-dist/target/te
>>z
>>-dist-0.7.1-SNAPSHOT-tests.jar> to
>>/home/jenkins/.m2/repository/org/apache/tez/tez-dist/0.7.1-SNAPSHOT/tez-d
>>i
>>st-0.7.1-SNAPSHOT-tests.jar
>>[INFO] 
>>[INFO] --- maven-deploy-plugin:2.8.1:deploy (default-deploy) @ tez-dist
>>---
>>[INFO] Skipping artifact deployment
>>[INFO] 
>>[INFO] --- buildnumber-maven-plugin:1.1:create (default) @ tez-dist ---
>>[INFO] Checking for local modifications: skipped.
>>[INFO] Updating project files from SCM: skipped.
>>[INFO] Executing: /bin/sh -c cd
>><https://builds.apache.org/job/Tez-Build-branch-0.7/ws/tez-dist> &&
git
>>rev-parse --verify HEAD
>>[INFO] Working directory:
>><https://builds.apache.org/job/Tez-Build-branch-0.7/ws/tez-dist>
>>[INFO] Storing buildNumber: a5a6794306d13341daf07314d62bebed5be2217a at
>>timestamp: 1433980132938
>>[INFO] Executing: /bin/sh -c cd
>><https://builds.apache.org/job/Tez-Build-branch-0.7/ws/tez-dist> &&
git
>>rev-parse --verify HEAD
>>[INFO] Working directory:
>><https://builds.apache.org/job/Tez-Build-branch-0.7/ws/tez-dist>
>>[INFO] Storing buildScmBranch: UNKNOWN
>>[INFO] 
>>[INFO] --- build-helper-maven-plugin:1.8:maven-version (maven-version) @
>>tez-dist ---
>>[INFO] 
>>[INFO] --- maven-assembly-plugin:2.4:single (package-tez) @ tez-dist ---
>>[INFO] Reading assembly descriptor: src/main/assembly/tez-dist.xml
>>[WARNING] NOTE: Currently, inclusion of module dependencies may produce
>>unpredictable results if a version conflict occurs.
>>[WARNING] The following patterns were never triggered in this artifact
>>exclusion filter:
>>o  '*:*:test-jar'
>>
>>[WARNING] The following patterns were never triggered in this artifact
>>exclusion filter:
>>o  '*:*:test-jar'
>>
>>[WARNING] The following patterns were never triggered in this artifact
>>exclusion filter:
>>o  '*:*:test-jar'
>>
>>[WARNING] The following patterns were never triggered in this artifact
>>exclusion filter:
>>o  '*:*:test-jar'
>>
>>[WARNING] The following patterns were never triggered in this artifact
>>exclusion filter:
>>o  '*:*:test-jar'
>>
>>[WARNING] The following patterns were never triggered in this artifact
>>exclusion filter:
>>o  '*:*:test-jar'
>>
>>[WARNING] The following patterns were never triggered in this artifact
>>exclusion filter:
>>o  '*:*:test-jar'
>>
>>[WARNING] The following patterns were never triggered in this artifact
>>exclusion filter:
>>o  '*:*:test-jar'
>>
>>[WARNING] The following patterns were never triggered in this artifact
>>exclusion filter:
>>o  '*:*:test-jar'
>>
>>[WARNING] The following patterns were never triggered in this artifact
>>exclusion filter:
>>o  '*:*:test-jar'
>>
>>[WARNING] The following patterns were never triggered in this artifact
>>exclusion filter:
>>o  '*:*:test-jar'
>>
>>[WARNING] The following patterns were never triggered in this artifact
>>exclusion filter:
>>o  '*:*:test-jar'
>>
>>[INFO] Copying files to
>><https://builds.apache.org/job/Tez-Build-branch-0.7/ws/tez-dist/target/te
>>z
>>-0.7.1-SNAPSHOT>
>>[WARNING] NOTE: Currently, inclusion of module dependencies may produce
>>unpredictable results if a version conflict occurs.
>>[WARNING] The following patterns were never triggered in this artifact
>>exclusion filter:
>>o  '*:*:test-jar'
>>
>>[WARNING] The following patterns were never triggered in this artifact
>>exclusion filter:
>>o  '*:*:test-jar'
>>
>>[WARNING] The following patterns were never triggered in this artifact
>>exclusion filter:
>>o  '*:*:test-jar'
>>
>>[WARNING] The following patterns were never triggered in this artifact
>>exclusion filter:
>>o  '*:*:test-jar'
>>
>>[WARNING] The following patterns were never triggered in this artifact
>>exclusion filter:
>>o  '*:*:test-jar'
>>
>>[WARNING] The following patterns were never triggered in this artifact
>>exclusion filter:
>>o  '*:*:test-jar'
>>
>>[WARNING] The following patterns were never triggered in this artifact
>>exclusion filter:
>>o  '*:*:test-jar'
>>
>>[WARNING] The following patterns were never triggered in this artifact
>>exclusion filter:
>>o  '*:*:test-jar'
>>
>>[WARNING] The following patterns were never triggered in this artifact
>>exclusion filter:
>>o  '*:*:test-jar'
>>
>>[WARNING] The following patterns were never triggered in this artifact
>>exclusion filter:
>>o  '*:*:test-jar'
>>
>>[WARNING] The following patterns were never triggered in this artifact
>>exclusion filter:
>>o  '*:*:test-jar'
>>
>>[WARNING] The following patterns were never triggered in this artifact
>>exclusion filter:
>>o  '*:*:test-jar'
>>
>>[INFO] Building tar:
>><https://builds.apache.org/job/Tez-Build-branch-0.7/26/artifact/tez-dist/
>>t
>>arget/tez-0.7.1-SNAPSHOT.tar.gz>
>>[INFO] 
>>[INFO] --- maven-assembly-plugin:2.4:single (package-tez-minimal) @
>>tez-dist ---
>>[INFO] Reading assembly descriptor:
>>src/main/assembly/tez-dist-minimal.xml
>>[WARNING] NOTE: Currently, inclusion of module dependencies may produce
>>unpredictable results if a version conflict occurs.
>>[WARNING] The following patterns were never triggered in this artifact
>>exclusion filter:
>>o  '*:*:test-jar'
>>
>>[WARNING] The following patterns were never triggered in this artifact
>>exclusion filter:
>>o  '*:*:test-jar'
>>
>>[WARNING] The following patterns were never triggered in this artifact
>>exclusion filter:
>>o  '*:*:test-jar'
>>
>>[WARNING] The following patterns were never triggered in this artifact
>>exclusion filter:
>>o  '*:*:test-jar'
>>
>>[WARNING] The following patterns were never triggered in this artifact
>>exclusion filter:
>>o  '*:*:test-jar'
>>
>>[WARNING] The following patterns were never triggered in this artifact
>>exclusion filter:
>>o  '*:*:test-jar'
>>
>>[WARNING] The following patterns were never triggered in this artifact
>>exclusion filter:
>>o  '*:*:test-jar'
>>
>>[WARNING] The following patterns were never triggered in this artifact
>>exclusion filter:
>>o  '*:*:test-jar'
>>
>>[WARNING] The following patterns were never triggered in this artifact
>>exclusion filter:
>>o  '*:*:test-jar'
>>
>>[WARNING] The following patterns were never triggered in this artifact
>>exclusion filter:
>>o  '*:*:test-jar'
>>
>>[WARNING] The following patterns were never triggered in this artifact
>>exclusion filter:
>>o  '*:*:test-jar'
>>
>>[WARNING] The following patterns were never triggered in this artifact
>>exclusion filter:
>>o  '*:*:test-jar'
>>
>>[INFO] Building tar:
>><https://builds.apache.org/job/Tez-Build-branch-0.7/26/artifact/tez-dist/
>>t
>>arget/tez-0.7.1-SNAPSHOT-minimal.tar.gz>
>>[INFO] 
>>[INFO] --- maven-jar-plugin:2.4:test-jar (default) @ tez-dist ---
>>[WARNING] JAR will be empty - no content was marked for inclusion!
>>[INFO]           
>>     
>>[INFO] 
>>------------------------------------------------------------------------
>>[INFO] Building Tez 0.7.1-SNAPSHOT
>>[INFO] 
>>------------------------------------------------------------------------
>>[INFO] 
>>[INFO] --- maven-clean-plugin:2.5:clean (default-clean) @ tez-docs ---
>>[INFO] Deleting 
>><https://builds.apache.org/job/Tez-Build-branch-0.7/ws/docs/target>
>>[INFO] 
>>[INFO] --- buildnumber-maven-plugin:1.1:create (default) @ tez-docs ---
>>[INFO] Checking for local modifications: skipped.
>>[INFO] Updating project files from SCM: skipped.
>>[INFO] Executing: /bin/sh -c cd
>><https://builds.apache.org/job/Tez-Build-branch-0.7/ws/docs> && git
>>rev-parse --verify HEAD
>>[INFO] Working directory:
>><https://builds.apache.org/job/Tez-Build-branch-0.7/ws/docs>
>>[INFO] Storing buildNumber: a5a6794306d13341daf07314d62bebed5be2217a at
>>timestamp: 1433980156627
>>[INFO] Executing: /bin/sh -c cd
>><https://builds.apache.org/job/Tez-Build-branch-0.7/ws/docs> && git
>>rev-parse --verify HEAD
>>[INFO] Working directory:
>><https://builds.apache.org/job/Tez-Build-branch-0.7/ws/docs>
>>[INFO] Storing buildScmBranch: UNKNOWN
>>[INFO] 
>>[INFO] --- build-helper-maven-plugin:1.8:maven-version (maven-version) @
>>tez-docs ---
>>[INFO] 
>>[INFO] --- buildnumber-maven-plugin:1.1:create (default) @ tez-docs ---
>>[INFO] Checking for local modifications: skipped.
>>[INFO] Updating project files from SCM: skipped.
>>[INFO] Executing: /bin/sh -c cd
>><https://builds.apache.org/job/Tez-Build-branch-0.7/ws/docs> && git
>>rev-parse --verify HEAD
>>[INFO] Working directory:
>><https://builds.apache.org/job/Tez-Build-branch-0.7/ws/docs>
>>[INFO] Storing buildNumber: a5a6794306d13341daf07314d62bebed5be2217a at
>>timestamp: 1433980156637
>>[INFO] Executing: /bin/sh -c cd
>><https://builds.apache.org/job/Tez-Build-branch-0.7/ws/docs> && git
>>rev-parse --verify HEAD
>>[INFO] Working directory:
>><https://builds.apache.org/job/Tez-Build-branch-0.7/ws/docs>
>>[INFO] Storing buildScmBranch: UNKNOWN
>>[INFO] 
>>[INFO] --- build-helper-maven-plugin:1.8:maven-version (maven-version) @
>>tez-docs ---
>>[INFO] 
>>[INFO] --- maven-jar-plugin:2.4:test-jar (default) @ tez-docs ---
>>[WARNING] JAR will be empty - no content was marked for inclusion!
>>[INFO] Building jar:
>><https://builds.apache.org/job/Tez-Build-branch-0.7/ws/docs/target/tez-do
>>c
>>s-0.7.1-SNAPSHOT-tests.jar>
>>[INFO] 
>>[INFO] --- maven-install-plugin:2.4:install (default-install) @ tez-docs
>>---
>>[INFO] Installing
>><https://builds.apache.org/job/Tez-Build-branch-0.7/ws/docs/pom.xml> to
>>/home/jenkins/.m2/repository/org/apache/tez/tez-docs/0.7.1-SNAPSHOT/tez-d
>>o
>>cs-0.7.1-SNAPSHOT.pom
>>[INFO] Installing
>><https://builds.apache.org/job/Tez-Build-branch-0.7/ws/docs/target/tez-do
>>c
>>s-0.7.1-SNAPSHOT-tests.jar> to
>>/home/jenkins/.m2/repository/org/apache/tez/tez-docs/0.7.1-SNAPSHOT/tez-d
>>o
>>cs-0.7.1-SNAPSHOT-tests.jar
>>[INFO] 
>>[INFO] --- maven-deploy-plugin:2.8.1:deploy (default-deploy) @ tez-docs
>>---
>>[INFO] Skipping artifact deployment
>>Downloading: 
>>https://repository.apache.org/content/repositories/snapshots/org/apache/t
>>e
>>z/tez/0.7.1-SNAPSHOT/maven-metadata.xml
>>
>>[WARNING] Could not transfer metadata
>>org.apache.tez:tez:0.7.1-SNAPSHOT/maven-metadata.xml from/to
>>apache.snapshots.https
>>(https://repository.apache.org/content/repositories/snapshots):
>>java.lang.RuntimeException: Could not generate DH keypair
>>[INFO] 
>>------------------------------------------------------------------------
>>[INFO] Reactor Summary:
>>[INFO] 
>>[INFO] tez ............................................... SUCCESS [
>>1.184 s]
>>[INFO] tez-api ........................................... SUCCESS [
>>16.121 s]
>>[INFO] tez-common ........................................ SUCCESS [
>>0.640 s]
>>[INFO] tez-runtime-internals ............................. SUCCESS [
>>0.861 s]
>>[INFO] tez-runtime-library ............................... SUCCESS [
>>3.379 s]
>>[INFO] tez-mapreduce ..................................... SUCCESS [
>>1.668 s]
>>[INFO] tez-examples ...................................... SUCCESS [
>>0.368 s]
>>[INFO] tez-dag ........................................... SUCCESS [
>>8.154 s]
>>[INFO] tez-tests ......................................... SUCCESS [
>>0.811 s]
>>[INFO] tez-ui ............................................ SUCCESS [
>>39.648 s]
>>[INFO] tez-plugins ....................................... SUCCESS [
>>0.081 s]
>>[INFO] tez-yarn-timeline-history ......................... SUCCESS [
>>0.701 s]
>>[INFO] tez-yarn-timeline-history-with-acls ............... SUCCESS [
>>0.534 s]
>>[INFO] tez-mbeans-resource-calculator .................... SUCCESS [
>>0.279 s]
>>[INFO] tez-tools ......................................... SUCCESS [
>>0.069 s]
>>[INFO] tez-dist .......................................... SUCCESS [
>>50.895 s]
>>[INFO] Tez ............................................... FAILURE [
>>0.776 s]
>>[INFO] 
>>------------------------------------------------------------------------
>>[INFO] BUILD FAILURE
>>[INFO] 
>>------------------------------------------------------------------------
>>[INFO] Total time: 02:06 min
>>[INFO] Finished at: 2015-06-10T23:49:17+00:00
>>[INFO] Final Memory: 68M/1185M
>>[INFO] 
>>------------------------------------------------------------------------
>>[ERROR] Failed to execute goal
>>org.apache.maven.plugins:maven-deploy-plugin:2.8.1:deploy
>>(default-deploy) on project tez-docs: Failed to retrieve remote metadata
>>org.apache.tez:tez:0.7.1-SNAPSHOT/maven-metadata.xml: Could not transfer
>>metadata org.apache.tez:tez:0.7.1-SNAPSHOT/maven-metadata.xml from/to
>>apache.snapshots.https
>>(https://repository.apache.org/content/repositories/snapshots):
>>java.lang.RuntimeException: Could not generate DH keypair: Prime size
>>must be multiple of 64, and can only range from 512 to 1024 (inclusive)
>>-> [Help 1]
>>[ERROR] 
>>[ERROR] To see the full stack trace of the errors, re-run Maven with the
>>-e switch.
>>[ERROR] Re-run Maven using the -X switch to enable full debug logging.
>>[ERROR] 
>>[ERROR] For more information about the errors and possible solutions,
>>please read the following articles:
>>[ERROR] [Help 1] 
>>http://cwiki.apache.org/confluence/display/MAVEN/MojoExecutionException
>>[ERROR] 
>>[ERROR] After correcting the problems, you can resume the build with the
>>command
>>[ERROR]   mvn <goals> -rf :tez-docs
>>Build step 'Execute shell' marked build as failure
>>Archiving artifacts
>>Sending artifact delta relative to Tez-Build-branch-0.7 #24
>>Archived 2 artifacts
>>Archive block size is 32768
>>Received 0 blocks and 51831123 bytes
>>Compression is 0.0%
>>Took 30 sec
>>
>
>


Mime
View raw message