tez-dev mailing list archives

Site index · List index
Message view « Date » · « Thread »
Top « Date » · « Thread »
From Apache Jenkins Server <jenk...@builds.apache.org>
Subject Build failed in Jenkins: Tez-Build-branch-TEZ-2980 #15
Date Wed, 20 Jan 2016 18:23:49 GMT
See <https://builds.apache.org/job/Tez-Build-branch-TEZ-2980/15/changes>

Changes:

[bikas] TEZ-2996. TestAnalyzer fails in trunk after recovery redesign (bikas)

[sree] TEZ-2997. Tez UI: Support searches by CallerContext ID for DAGs (sree)

[zjffdu] TEZ-2976. Recovery fails when InputDescriptor is changed during input

[hitesh] TEZ-2910. Set caller context for tracing ( integrate with HDFS-9184 ).

[rbalamohan] TEZ-3006. Remove unused import in TestHistoryParser (rbalamohan)

[rbalamohan] Updating CHANGES.txt (rbalamohan)

[jeagles] TEZ-3011. Link Vertex Name in Dag Tasks/Task Attempts to Vertex

[jlowe] TEZ-2972. Avoid task rescheduling when a node turns unhealthy (jlowe)

[bikas] TEZ-2972. addendum for findbugs. (Jason Lowe via bikas)

[bikas] TEZ-2914. Ability to limit vertex concurrency (bikas)

[bikas] Fix CHANGES.txt for recent back-ports

[bikas] TEZ-3017. HistoryACLManager does not have a close method for cleanup

[sseth] TEZ-3025. InputInitializer creation should use the dag ugi. (sseth)

[jeagles] TEZ-2129. Task and Attempt views should contain links to the logs

[sseth] TEZ-2978. Add an option to allow the SplitGrouper to generate node local

[sseth] TEZ-2669. Propagation of errors from plugins to the AM for error

[sseth] TEZ-3024. Move TaskCommunicator to correct package. (sseth)

[sseth] TEZ-3033 changes for 0.8.2 release part1. Update version to

[hitesh] TEZ-3032. DAG start time getting logged using system time instead of

[hitesh] Fix CHANGES.txt for TEZ-3032

[hitesh] TEZ-3037. History URL should be set regardless of which history logging

[hitesh] TEZ-3032. Addendum patch. DAG start time getting logged using system

[jeagles] TEZ-2937. Can Processor.close() be called after closing inputs and

[sseth] TEZ-3033 part2. Update documentation for 0.8.2 release.

[rbalamohan] TEZ-2898. tez tools : swimlanes.py is broken in master (rbalamohan)

[sree] TEZ-2982. Tez UI: Create tez-ui2 directory and get a basic dummy page

[sree] TEZ-3016. Tez UI 2: Make bower dependency silent (sree)

[sree] TEZ-2983. Tez UI 2: Get ember initializers functional (sree)

[sree] TEZ-3018. Tez UI 2: Add config.env (sree)

[sree] TEZ-3019. Tez UI 2: Replace BaseURL with Host (sree)

[sree] TEZ-2984. Tez UI 2: Create abstract classes (sree)

[sree] TEZ-3020. Tez UI 2: Add entity blueprint (sree)

[sree] TEZ-2985. Tez UI 2: Create loader and entity classes (sree)

[sree] TEZ-3021. Tez UI 2: Add env service & initializer (sree)

[sree] TEZ-3023. Tez UI 2: Abstract adapter and route (sree)

[sree] TEZ-3022. Tez UI 2: Add serializer & adapter for timeline server (sree)

[sree] Update version in branch to 0.8.2-TEZ-2980-SNAPSHOT to prevent

[sree] TEZ-3026. Tez UI 2: Add adapters for RM & AM (sree)

[sree] TEZ-3027. Tez UI 2: Add header and footer elements (sree)

[sree] TEZ-2986. Tez UI 2: Implement All DAGs page (sree)

[sree] TEZ-3038. Tez UI 2: Create DAG details page (sree)

[sree] TEZ-3039. Tez UI 2: Create all sub-pages for DAG (sree)

[sree] TEZ-3040. Tez UI 2: Create Vertex details page & sub tables (sree)

[sree] TEZ-3041. Tez UI 2: Create Task & Attempt details page with sub tables

[sree] TEZ-3045. Tez UI 2: Create application details page with DAGs tab (sree)

[sree] TEZ-3048. Tez UI 2: Make PhantomJS a local dependency for build tests

[sree] TEZ-3042. Tez UI 2: Create Counters pages (sree)

[sree] TEZ-3043. Tez UI 2: Create configurations page (sree)

[sree] TEZ-3049. Tez UI 2: Add column selector (sree)

[sree] TEZ-3050. Tez UI 2: Add counter columns (sree)

------------------------------------------
[...truncated 4819 lines...]
[INFO] 
[INFO] --- maven-surefire-plugin:2.14.1:test (default-test) @ tez-javadoc-tools ---
[INFO] No tests to run.
[INFO] 
[INFO] --- buildnumber-maven-plugin:1.1:create (default) @ tez-javadoc-tools ---
[INFO] Checking for local modifications: skipped.
[INFO] Updating project files from SCM: skipped.
[INFO] Executing: /bin/sh -c cd <https://builds.apache.org/job/Tez-Build-branch-TEZ-2980/ws/tez-tools/tez-javadoc-tools>
&& git rev-parse --verify HEAD
[INFO] Working directory: <https://builds.apache.org/job/Tez-Build-branch-TEZ-2980/ws/tez-tools/tez-javadoc-tools>
[INFO] Storing buildNumber: 8d80272ca0e27287aa2b95eb3b23e75a67b957c7 at timestamp: 1453314240776
[INFO] Executing: /bin/sh -c cd <https://builds.apache.org/job/Tez-Build-branch-TEZ-2980/ws/tez-tools/tez-javadoc-tools>
&& git rev-parse --verify HEAD
[INFO] Working directory: <https://builds.apache.org/job/Tez-Build-branch-TEZ-2980/ws/tez-tools/tez-javadoc-tools>
[INFO] Storing buildScmBranch: UNKNOWN
[INFO] 
[INFO] --- build-helper-maven-plugin:1.8:maven-version (maven-version) @ tez-javadoc-tools
---
[INFO] 
[INFO] --- maven-resources-plugin:2.6:resources (default-resources) @ tez-javadoc-tools ---
[INFO] Using 'UTF-8' encoding to copy filtered resources.
[INFO] skip non existing resourceDirectory <https://builds.apache.org/job/Tez-Build-branch-TEZ-2980/ws/tez-tools/tez-javadoc-tools/src/main/resources>
[INFO] 
[INFO] --- maven-compiler-plugin:3.1:compile (default-compile) @ tez-javadoc-tools ---
[INFO] Nothing to compile - all classes are up to date
[INFO] 
[INFO] --- maven-resources-plugin:2.6:testResources (default-testResources) @ tez-javadoc-tools
---
[INFO] Using 'UTF-8' encoding to copy filtered resources.
[INFO] skip non existing resourceDirectory <https://builds.apache.org/job/Tez-Build-branch-TEZ-2980/ws/tez-tools/tez-javadoc-tools/src/test/resources>
[INFO] 
[INFO] --- maven-compiler-plugin:3.1:testCompile (default-testCompile) @ tez-javadoc-tools
---
[INFO] No sources to compile
[INFO] 
[INFO] --- maven-surefire-plugin:2.14.1:test (default-test) @ tez-javadoc-tools ---
[INFO] No tests to run.
[INFO] Skipping execution of surefire because it has already been run for this configuration
[INFO] 
[INFO] --- maven-jar-plugin:2.4:jar (default-jar) @ tez-javadoc-tools ---
[INFO] Building jar: <https://builds.apache.org/job/Tez-Build-branch-TEZ-2980/ws/tez-tools/tez-javadoc-tools/target/tez-javadoc-tools-0.8.3-SNAPSHOT.jar>
[INFO] 
[INFO] --- maven-jar-plugin:2.4:test-jar (default) @ tez-javadoc-tools ---
[WARNING] JAR will be empty - no content was marked for inclusion!
[INFO] Building jar: <https://builds.apache.org/job/Tez-Build-branch-TEZ-2980/ws/tez-tools/tez-javadoc-tools/target/tez-javadoc-tools-0.8.3-SNAPSHOT-tests.jar>
[INFO]                                                                         
[INFO] ------------------------------------------------------------------------
[INFO] Building hadoop-shim-impls 0.8.3-SNAPSHOT
[INFO] ------------------------------------------------------------------------
[INFO] 
[INFO] --- maven-clean-plugin:2.5:clean (default-clean) @ hadoop-shim-impls ---
[INFO] 
[INFO] --- buildnumber-maven-plugin:1.1:create (default) @ hadoop-shim-impls ---
[INFO] Checking for local modifications: skipped.
[INFO] Updating project files from SCM: skipped.
[INFO] Executing: /bin/sh -c cd <https://builds.apache.org/job/Tez-Build-branch-TEZ-2980/ws/hadoop-shim-impls>
&& git rev-parse --verify HEAD
[INFO] Working directory: <https://builds.apache.org/job/Tez-Build-branch-TEZ-2980/ws/hadoop-shim-impls>
[INFO] Storing buildNumber: 8d80272ca0e27287aa2b95eb3b23e75a67b957c7 at timestamp: 1453314240842
[INFO] Executing: /bin/sh -c cd <https://builds.apache.org/job/Tez-Build-branch-TEZ-2980/ws/hadoop-shim-impls>
&& git rev-parse --verify HEAD
[INFO] Working directory: <https://builds.apache.org/job/Tez-Build-branch-TEZ-2980/ws/hadoop-shim-impls>
[INFO] Storing buildScmBranch: UNKNOWN
[INFO] 
[INFO] --- build-helper-maven-plugin:1.8:maven-version (maven-version) @ hadoop-shim-impls
---
[INFO] 
[INFO] --- buildnumber-maven-plugin:1.1:create (default) @ hadoop-shim-impls ---
[INFO] Checking for local modifications: skipped.
[INFO] Updating project files from SCM: skipped.
[INFO] Executing: /bin/sh -c cd <https://builds.apache.org/job/Tez-Build-branch-TEZ-2980/ws/hadoop-shim-impls>
&& git rev-parse --verify HEAD
[INFO] Working directory: <https://builds.apache.org/job/Tez-Build-branch-TEZ-2980/ws/hadoop-shim-impls>
[INFO] Storing buildNumber: 8d80272ca0e27287aa2b95eb3b23e75a67b957c7 at timestamp: 1453314240853
[INFO] Executing: /bin/sh -c cd <https://builds.apache.org/job/Tez-Build-branch-TEZ-2980/ws/hadoop-shim-impls>
&& git rev-parse --verify HEAD
[INFO] Working directory: <https://builds.apache.org/job/Tez-Build-branch-TEZ-2980/ws/hadoop-shim-impls>
[INFO] Storing buildScmBranch: UNKNOWN
[INFO] 
[INFO] --- build-helper-maven-plugin:1.8:maven-version (maven-version) @ hadoop-shim-impls
---
[INFO] 
[INFO] --- maven-jar-plugin:2.4:test-jar (default) @ hadoop-shim-impls ---
[WARNING] JAR will be empty - no content was marked for inclusion!
[INFO] Building jar: <https://builds.apache.org/job/Tez-Build-branch-TEZ-2980/ws/hadoop-shim-impls/target/hadoop-shim-impls-0.8.3-SNAPSHOT-tests.jar>
[INFO]                                                                         
[INFO] ------------------------------------------------------------------------
[INFO] Building hadoop-shim-2.6 0.8.3-SNAPSHOT
[INFO] ------------------------------------------------------------------------
[INFO] 
[INFO] --- maven-clean-plugin:2.5:clean (default-clean) @ hadoop-shim-2.6 ---
[INFO] 
[INFO] --- buildnumber-maven-plugin:1.1:create (default) @ hadoop-shim-2.6 ---
[INFO] Checking for local modifications: skipped.
[INFO] Updating project files from SCM: skipped.
[INFO] Executing: /bin/sh -c cd <https://builds.apache.org/job/Tez-Build-branch-TEZ-2980/ws/hadoop-shim-impls/hadoop-shim-2.6>
&& git rev-parse --verify HEAD
[INFO] Working directory: <https://builds.apache.org/job/Tez-Build-branch-TEZ-2980/ws/hadoop-shim-impls/hadoop-shim-2.6>
[INFO] Storing buildNumber: 8d80272ca0e27287aa2b95eb3b23e75a67b957c7 at timestamp: 1453314240905
[INFO] Executing: /bin/sh -c cd <https://builds.apache.org/job/Tez-Build-branch-TEZ-2980/ws/hadoop-shim-impls/hadoop-shim-2.6>
&& git rev-parse --verify HEAD
[INFO] Working directory: <https://builds.apache.org/job/Tez-Build-branch-TEZ-2980/ws/hadoop-shim-impls/hadoop-shim-2.6>
[INFO] Storing buildScmBranch: UNKNOWN
[INFO] 
[INFO] --- build-helper-maven-plugin:1.8:maven-version (maven-version) @ hadoop-shim-2.6 ---
[INFO] 
[INFO] --- maven-resources-plugin:2.6:resources (default-resources) @ hadoop-shim-2.6 ---
[INFO] Using 'UTF-8' encoding to copy filtered resources.
[INFO] Copying 1 resource
[INFO] 
[INFO] --- maven-compiler-plugin:3.1:compile (default-compile) @ hadoop-shim-2.6 ---
[INFO] Changes detected - recompiling the module!
[INFO] Compiling 2 source files to <https://builds.apache.org/job/Tez-Build-branch-TEZ-2980/ws/hadoop-shim-impls/hadoop-shim-2.6/target/classes>
[INFO] 
[INFO] --- maven-resources-plugin:2.6:testResources (default-testResources) @ hadoop-shim-2.6
---
[INFO] Using 'UTF-8' encoding to copy filtered resources.
[INFO] skip non existing resourceDirectory <https://builds.apache.org/job/Tez-Build-branch-TEZ-2980/ws/hadoop-shim-impls/hadoop-shim-2.6/src/test/resources>
[INFO] 
[INFO] --- maven-compiler-plugin:3.1:testCompile (default-testCompile) @ hadoop-shim-2.6 ---
[INFO] Changes detected - recompiling the module!
[INFO] Compiling 1 source file to <https://builds.apache.org/job/Tez-Build-branch-TEZ-2980/ws/hadoop-shim-impls/hadoop-shim-2.6/target/test-classes>
[INFO] 
[INFO] --- maven-surefire-plugin:2.14.1:test (default-test) @ hadoop-shim-2.6 ---
[INFO] Surefire report directory: <https://builds.apache.org/job/Tez-Build-branch-TEZ-2980/ws/hadoop-shim-impls/hadoop-shim-2.6/target/surefire-reports>

-------------------------------------------------------
 T E S T S
-------------------------------------------------------

-------------------------------------------------------
 T E S T S
-------------------------------------------------------
Running org.apache.tez.hadoop.shim.TestHadoop25_26_27ShimProvider
Tests run: 4, Failures: 0, Errors: 0, Skipped: 0, Time elapsed: 0.214 sec

Results :

Tests run: 4, Failures: 0, Errors: 0, Skipped: 0

[INFO] 
[INFO] --- buildnumber-maven-plugin:1.1:create (default) @ hadoop-shim-2.6 ---
[INFO] Checking for local modifications: skipped.
[INFO] Updating project files from SCM: skipped.
[INFO] Executing: /bin/sh -c cd <https://builds.apache.org/job/Tez-Build-branch-TEZ-2980/ws/hadoop-shim-impls/hadoop-shim-2.6>
&& git rev-parse --verify HEAD
[INFO] Working directory: <https://builds.apache.org/job/Tez-Build-branch-TEZ-2980/ws/hadoop-shim-impls/hadoop-shim-2.6>
[INFO] Storing buildNumber: 8d80272ca0e27287aa2b95eb3b23e75a67b957c7 at timestamp: 1453314241532
[INFO] Executing: /bin/sh -c cd <https://builds.apache.org/job/Tez-Build-branch-TEZ-2980/ws/hadoop-shim-impls/hadoop-shim-2.6>
&& git rev-parse --verify HEAD
[INFO] Working directory: <https://builds.apache.org/job/Tez-Build-branch-TEZ-2980/ws/hadoop-shim-impls/hadoop-shim-2.6>
[INFO] Storing buildScmBranch: UNKNOWN
[INFO] 
[INFO] --- build-helper-maven-plugin:1.8:maven-version (maven-version) @ hadoop-shim-2.6 ---
[INFO] 
[INFO] --- maven-resources-plugin:2.6:resources (default-resources) @ hadoop-shim-2.6 ---
[INFO] Using 'UTF-8' encoding to copy filtered resources.
[INFO] Copying 1 resource
[INFO] 
[INFO] --- maven-compiler-plugin:3.1:compile (default-compile) @ hadoop-shim-2.6 ---
[INFO] Nothing to compile - all classes are up to date
[INFO] 
[INFO] --- maven-resources-plugin:2.6:testResources (default-testResources) @ hadoop-shim-2.6
---
[INFO] Using 'UTF-8' encoding to copy filtered resources.
[INFO] skip non existing resourceDirectory <https://builds.apache.org/job/Tez-Build-branch-TEZ-2980/ws/hadoop-shim-impls/hadoop-shim-2.6/src/test/resources>
[INFO] 
[INFO] --- maven-compiler-plugin:3.1:testCompile (default-testCompile) @ hadoop-shim-2.6 ---
[INFO] Nothing to compile - all classes are up to date
[INFO] 
[INFO] --- maven-surefire-plugin:2.14.1:test (default-test) @ hadoop-shim-2.6 ---
[INFO] Skipping execution of surefire because it has already been run for this configuration
[INFO] 
[INFO] --- maven-jar-plugin:2.4:jar (default-jar) @ hadoop-shim-2.6 ---
[INFO] Building jar: <https://builds.apache.org/job/Tez-Build-branch-TEZ-2980/ws/hadoop-shim-impls/hadoop-shim-2.6/target/hadoop-shim-2.6-0.8.3-SNAPSHOT.jar>
[INFO] 
[INFO] --- maven-jar-plugin:2.4:test-jar (default) @ hadoop-shim-2.6 ---
[INFO] Building jar: <https://builds.apache.org/job/Tez-Build-branch-TEZ-2980/ws/hadoop-shim-impls/hadoop-shim-2.6/target/hadoop-shim-2.6-0.8.3-SNAPSHOT-tests.jar>
[INFO]                                                                         
[INFO] ------------------------------------------------------------------------
[INFO] Skipping tez-dist
[INFO] This project has been banned from the build due to previous failures.
[INFO] ------------------------------------------------------------------------
[INFO]                                                                         
[INFO] ------------------------------------------------------------------------
[INFO] Building Tez 0.8.3-SNAPSHOT
[INFO] ------------------------------------------------------------------------
[INFO] 
[INFO] --- maven-clean-plugin:2.5:clean (default-clean) @ tez-docs ---
[INFO] 
[INFO] --- buildnumber-maven-plugin:1.1:create (default) @ tez-docs ---
[INFO] Checking for local modifications: skipped.
[INFO] Updating project files from SCM: skipped.
[INFO] Executing: /bin/sh -c cd <https://builds.apache.org/job/Tez-Build-branch-TEZ-2980/ws/docs>
&& git rev-parse --verify HEAD
[INFO] Working directory: <https://builds.apache.org/job/Tez-Build-branch-TEZ-2980/ws/docs>
[INFO] Storing buildNumber: 8d80272ca0e27287aa2b95eb3b23e75a67b957c7 at timestamp: 1453314241580
[INFO] Executing: /bin/sh -c cd <https://builds.apache.org/job/Tez-Build-branch-TEZ-2980/ws/docs>
&& git rev-parse --verify HEAD
[INFO] Working directory: <https://builds.apache.org/job/Tez-Build-branch-TEZ-2980/ws/docs>
[INFO] Storing buildScmBranch: UNKNOWN
[INFO] 
[INFO] --- build-helper-maven-plugin:1.8:maven-version (maven-version) @ tez-docs ---
[INFO] 
[INFO] --- buildnumber-maven-plugin:1.1:create (default) @ tez-docs ---
[INFO] Checking for local modifications: skipped.
[INFO] Updating project files from SCM: skipped.
[INFO] Executing: /bin/sh -c cd <https://builds.apache.org/job/Tez-Build-branch-TEZ-2980/ws/docs>
&& git rev-parse --verify HEAD
[INFO] Working directory: <https://builds.apache.org/job/Tez-Build-branch-TEZ-2980/ws/docs>
[INFO] Storing buildNumber: 8d80272ca0e27287aa2b95eb3b23e75a67b957c7 at timestamp: 1453314241589
[INFO] Executing: /bin/sh -c cd <https://builds.apache.org/job/Tez-Build-branch-TEZ-2980/ws/docs>
&& git rev-parse --verify HEAD
[INFO] Working directory: <https://builds.apache.org/job/Tez-Build-branch-TEZ-2980/ws/docs>
[INFO] Storing buildScmBranch: UNKNOWN
[INFO] 
[INFO] --- build-helper-maven-plugin:1.8:maven-version (maven-version) @ tez-docs ---
[INFO] 
[INFO] --- maven-jar-plugin:2.4:test-jar (default) @ tez-docs ---
[WARNING] JAR will be empty - no content was marked for inclusion!
[INFO] Building jar: <https://builds.apache.org/job/Tez-Build-branch-TEZ-2980/ws/docs/target/tez-docs-0.8.3-SNAPSHOT-tests.jar>
[INFO] ------------------------------------------------------------------------
[INFO] Reactor Summary:
[INFO] 
[INFO] tez ............................................... SUCCESS [  1.536 s]
[INFO] hadoop-shim ....................................... SUCCESS [  2.383 s]
[INFO] tez-api ........................................... SUCCESS [ 47.470 s]
[INFO] tez-common ........................................ SUCCESS [  4.693 s]
[INFO] tez-runtime-internals ............................. SUCCESS [ 13.244 s]
[INFO] tez-runtime-library ............................... SUCCESS [02:43 min]
[INFO] tez-mapreduce ..................................... SUCCESS [ 32.369 s]
[INFO] tez-examples ...................................... SUCCESS [  0.261 s]
[INFO] tez-dag ........................................... SUCCESS [02:20 min]
[INFO] tez-tests ......................................... FAILURE [34:19 min]
[INFO] tez-ext-service-tests ............................. SKIPPED
[INFO] tez-ui ............................................ SUCCESS [01:33 min]
[INFO] tez-ui2 ........................................... SUCCESS [05:51 min]
[INFO] tez-plugins ....................................... SUCCESS [  0.038 s]
[INFO] tez-yarn-timeline-history ......................... SKIPPED
[INFO] tez-yarn-timeline-history-with-acls ............... SKIPPED
[INFO] tez-history-parser ................................ SKIPPED
[INFO] tez-tools ......................................... SUCCESS [  0.037 s]
[INFO] tez-perf-analyzer ................................. SUCCESS [  0.051 s]
[INFO] tez-job-analyzer .................................. SKIPPED
[INFO] tez-javadoc-tools ................................. SUCCESS [  0.209 s]
[INFO] hadoop-shim-impls ................................. SUCCESS [  0.033 s]
[INFO] hadoop-shim-2.6 ................................... SUCCESS [  0.705 s]
[INFO] tez-dist .......................................... SKIPPED
[INFO] Tez ............................................... SUCCESS [  0.042 s]
[INFO] ------------------------------------------------------------------------
[INFO] BUILD FAILURE
[INFO] ------------------------------------------------------------------------
[INFO] Total time: 48:32 min
[INFO] Finished at: 2016-01-20T18:24:01+00:00
[INFO] Final Memory: 42M/906M
[INFO] ------------------------------------------------------------------------
[ERROR] Failed to execute goal org.apache.maven.plugins:maven-surefire-plugin:2.14.1:test
(default-test) on project tez-tests: ExecutionException; nested exception is java.util.concurrent.ExecutionException:
java.lang.RuntimeException: The forked VM terminated without saying properly goodbye. VM crash
or System.exit called ?
[ERROR] Command was/bin/sh -c cd <https://builds.apache.org/job/Tez-Build-branch-TEZ-2980/ws/tez-tests>
&& /home/jenkins/tools/java/jdk1.7.0_55/jre/bin/java -Xmx1024m -XX:+HeapDumpOnOutOfMemoryError
-jar <https://builds.apache.org/job/Tez-Build-branch-TEZ-2980/ws/tez-tests/target/surefire/surefirebooter7969522228209062290.jar>
<https://builds.apache.org/job/Tez-Build-branch-TEZ-2980/ws/tez-tests/target/surefire/surefire2739847812820273758tmp>
<https://builds.apache.org/job/Tez-Build-branch-TEZ-2980/ws/tez-tests/target/surefire/surefire_149597568857095386579tmp>
[ERROR] -> [Help 1]
[ERROR] 
[ERROR] To see the full stack trace of the errors, re-run Maven with the -e switch.
[ERROR] Re-run Maven using the -X switch to enable full debug logging.
[ERROR] 
[ERROR] For more information about the errors and possible solutions, please read the following
articles:
[ERROR] [Help 1] http://cwiki.apache.org/confluence/display/MAVEN/MojoFailureException
[ERROR] 
[ERROR] After correcting the problems, you can resume the build with the command
[ERROR]   mvn <goals> -rf :tez-tests
Build step 'Execute shell' marked build as failure
Archiving artifacts

Mime
View raw message