tez-dev mailing list archives

Site index · List index
Message view « Date » · « Thread »
Top « Date » · « Thread »
From "Lvpenglin (JIRA)" <j...@apache.org>
Subject [jira] [Created] (TEZ-3055) I got this jar is by the mvn package and run it on my cluster,occurred this problem.I can run the example which the tez given successful.But when I run this jar which is packaged by mvn packsge myself is failed.
Date Wed, 20 Jan 2016 06:21:40 GMT
Lvpenglin created TEZ-3055:
------------------------------

             Summary: I got this jar is by the mvn package and run it on my cluster,occurred
this problem.I can run the example which the tez given successful.But when I run this jar
which is packaged by mvn packsge myself is failed.
                 Key: TEZ-3055
                 URL: https://issues.apache.org/jira/browse/TEZ-3055
             Project: Apache Tez
          Issue Type: Bug
         Environment: this is the tez orderedwordcount example,I want it can be run on my
cluster,but occurred this problem.This code is packaged by myself.When I run the tez's example
jar on my cluster,it's ok.My environment is hadoop2.6.0+tez0.7.0.Can you give me some suggestion?

            Reporter: Lvpenglin


Vertex failed, vertexName=ASSOCIATE, vertexId=vertex_1452667827400_0022_1_00, diagnostics=
 Task failed, taskId=task_1452667827400_0022_1_00_000000, diagnostics=
 TaskAttempt 0 failed, info=
 Error: Failure while running task:org.apache.tez.dag.api.TezUncheckedException: Unable to
load class: com.teradata.sddg.sgprocessor.TezDataGeneratorTest$DataGenerationProcessor
at org.apache.tez.common.ReflectionUtils.getClazz(ReflectionUtils.java:45)
at org.apache.tez.common.ReflectionUtils.createClazzInstance(ReflectionUtils.java:96)
at org.apache.tez.runtime.LogicalIOProcessorRuntimeTask.createProcessor(LogicalIOProcessorRuntimeTask.java:584)
at org.apache.tez.runtime.LogicalIOProcessorRuntimeTask.initialize(LogicalIOProcessorRuntimeTask.java:202)
at org.apache.tez.runtime.task.TezTaskRunner$TaskRunnerCallable$1.run(TezTaskRunner.java:176)
at org.apache.tez.runtime.task.TezTaskRunner$TaskRunnerCallable$1.run(TezTaskRunner.java:171)
at java.security.AccessController.doPrivileged(Native Method)
at javax.security.auth.Subject.doAs(Subject.java:415)
at org.apache.hadoop.security.UserGroupInformation.doAs(UserGroupInformation.java:1628)
at org.apache.tez.runtime.task.TezTaskRunner$TaskRunnerCallable.callInternal(TezTaskRunner.java:171)
at org.apache.tez.runtime.task.TezTaskRunner$TaskRunnerCallable.callInternal(TezTaskRunner.java:167)
at org.apache.tez.common.CallableWithNdc.call(CallableWithNdc.java:36)
at java.util.concurrent.FutureTask.run(FutureTask.java:262)
at java.util.concurrent.ThreadPoolExecutor.runWorker(ThreadPoolExecutor.java:1145)
at java.util.concurrent.ThreadPoolExecutor$Worker.run(ThreadPoolExecutor.java:615)
at java.lang.Thread.run(Thread.java:745)
Caused by: java.lang.ClassNotFoundException: com.teradata.sddg.sgprocessor.TezDataGeneratorTest$DataGenerationProcessor
at java.net.URLClassLoader$1.run(URLClassLoader.java:366)
at java.net.URLClassLoader$1.run(URLClassLoader.java:355)
at java.security.AccessController.doPrivileged(Native Method)
at java.net.URLClassLoader.findClass(URLClassLoader.java:354)
at java.lang.ClassLoader.loadClass(ClassLoader.java:425)
at sun.misc.Launcher$AppClassLoader.loadClass(Launcher.java:308)
at java.lang.ClassLoader.loadClass(ClassLoader.java:358)
at java.lang.Class.forName0(Native Method)
at java.lang.Class.forName(Class.java:274)
at org.apache.tez.common.ReflectionUtils.getClazz(ReflectionUtils.java:43)
... 15 more
TaskAttempt 1 failed, info=
 Error: Failure while running task:org.apache.tez.dag.api.TezUncheckedException: Unable to
load class: com.teradata.sddg.sgprocessor.TezDataGeneratorTest$DataGenerationProcessor
at org.apache.tez.common.ReflectionUtils.getClazz(ReflectionUtils.java:45)
at org.apache.tez.common.ReflectionUtils.createClazzInstance(ReflectionUtils.java:96)
at org.apache.tez.runtime.LogicalIOProcessorRuntimeTask.createProcessor(LogicalIOProcessorRuntimeTask.java:584)
at org.apache.tez.runtime.LogicalIOProcessorRuntimeTask.initialize(LogicalIOProcessorRuntimeTask.java:202)
at org.apache.tez.runtime.task.TezTaskRunner$TaskRunnerCallable$1.run(TezTaskRunner.java:176)
at org.apache.tez.runtime.task.TezTaskRunner$TaskRunnerCallable$1.run(TezTaskRunner.java:171)
at java.security.AccessController.doPrivileged(Native Method)
at javax.security.auth.Subject.doAs(Subject.java:415)
at org.apache.hadoop.security.UserGroupInformation.doAs(UserGroupInformation.java:1628)
at org.apache.tez.runtime.task.TezTaskRunner$TaskRunnerCallable.callInternal(TezTaskRunner.java:171)
at org.apache.tez.runtime.task.TezTaskRunner$TaskRunnerCallable.callInternal(TezTaskRunner.java:167)
at org.apache.tez.common.CallableWithNdc.call(CallableWithNdc.java:36)
at java.util.concurrent.FutureTask.run(FutureTask.java:262)
at java.util.concurrent.ThreadPoolExecutor.runWorker(ThreadPoolExecutor.java:1145)
at java.util.concurrent.ThreadPoolExecutor$Worker.run(ThreadPoolExecutor.java:615)
at java.lang.Thread.run(Thread.java:745)
Caused by: java.lang.ClassNotFoundException: com.teradata.sddg.sgprocessor.TezDataGeneratorTest$DataGenerationProcessor
at java.net.URLClassLoader$1.run(URLClassLoader.java:366)
at java.net.URLClassLoader$1.run(URLClassLoader.java:355)
at java.security.AccessController.doPrivileged(Native Method)
at java.net.URLClassLoader.findClass(URLClassLoader.java:354)
at java.lang.ClassLoader.loadClass(ClassLoader.java:425)
at sun.misc.Launcher$AppClassLoader.loadClass(Launcher.java:308)
at java.lang.ClassLoader.loadClass(ClassLoader.java:358)
at java.lang.Class.forName0(Native Method)
at java.lang.Class.forName(Class.java:274)
at org.apache.tez.common.ReflectionUtils.getClazz(ReflectionUtils.java:43)
... 15 more
TaskAttempt 2 failed, info=
 Error: Failure while running task:org.apache.tez.dag.api.TezUncheckedException: Unable to
load class: com.teradata.sddg.sgprocessor.TezDataGeneratorTest$DataGenerationProcessor
at org.apache.tez.common.ReflectionUtils.getClazz(ReflectionUtils.java:45)
at org.apache.tez.common.ReflectionUtils.createClazzInstance(ReflectionUtils.java:96)
at org.apache.tez.runtime.LogicalIOProcessorRuntimeTask.createProcessor(LogicalIOProcessorRuntimeTask.java:584)
at org.apache.tez.runtime.LogicalIOProcessorRuntimeTask.initialize(LogicalIOProcessorRuntimeTask.java:202)
at org.apache.tez.runtime.task.TezTaskRunner$TaskRunnerCallable$1.run(TezTaskRunner.java:176)
at org.apache.tez.runtime.task.TezTaskRunner$TaskRunnerCallable$1.run(TezTaskRunner.java:171)
at java.security.AccessController.doPrivileged(Native Method)
at javax.security.auth.Subject.doAs(Subject.java:415)
at org.apache.hadoop.security.UserGroupInformation.doAs(UserGroupInformation.java:1628)
at org.apache.tez.runtime.task.TezTaskRunner$TaskRunnerCallable.callInternal(TezTaskRunner.java:171)
at org.apache.tez.runtime.task.TezTaskRunner$TaskRunnerCallable.callInternal(TezTaskRunner.java:167)
at org.apache.tez.common.CallableWithNdc.call(CallableWithNdc.java:36)
at java.util.concurrent.FutureTask.run(FutureTask.java:262)
at java.util.concurrent.ThreadPoolExecutor.runWorker(ThreadPoolExecutor.java:1145)
at java.util.concurrent.ThreadPoolExecutor$Worker.run(ThreadPoolExecutor.java:615)
at java.lang.Thread.run(Thread.java:745)
Caused by: java.lang.ClassNotFoundException: com.teradata.sddg.sgprocessor.TezDataGeneratorTest$DataGenerationProcessor
at java.net.URLClassLoader$1.run(URLClassLoader.java:366)
at java.net.URLClassLoader$1.run(URLClassLoader.java:355)
at java.security.AccessController.doPrivileged(Native Method)
at java.net.URLClassLoader.findClass(URLClassLoader.java:354)
at java.lang.ClassLoader.loadClass(ClassLoader.java:425)
at sun.misc.Launcher$AppClassLoader.loadClass(Launcher.java:308)
at java.lang.ClassLoader.loadClass(ClassLoader.java:358)
at java.lang.Class.forName0(Native Method)
at java.lang.Class.forName(Class.java:274)
at org.apache.tez.common.ReflectionUtils.getClazz(ReflectionUtils.java:43)
... 15 more
TaskAttempt 3 failed, info=
 Error: Failure while running task:org.apache.tez.dag.api.TezUncheckedException: Unable to
load class: com.teradata.sddg.sgprocessor.TezDataGeneratorTest$DataGenerationProcessor
at org.apache.tez.common.ReflectionUtils.getClazz(ReflectionUtils.java:45)
at org.apache.tez.common.ReflectionUtils.createClazzInstance(ReflectionUtils.java:96)
at org.apache.tez.runtime.LogicalIOProcessorRuntimeTask.createProcessor(LogicalIOProcessorRuntimeTask.java:584)
at org.apache.tez.runtime.LogicalIOProcessorRuntimeTask.initialize(LogicalIOProcessorRuntimeTask.java:202)
at org.apache.tez.runtime.task.TezTaskRunner$TaskRunnerCallable$1.run(TezTaskRunner.java:176)
at org.apache.tez.runtime.task.TezTaskRunner$TaskRunnerCallable$1.run(TezTaskRunner.java:171)
at java.security.AccessController.doPrivileged(Native Method)
at javax.security.auth.Subject.doAs(Subject.java:415)
at org.apache.hadoop.security.UserGroupInformation.doAs(UserGroupInformation.java:1628)
at org.apache.tez.runtime.task.TezTaskRunner$TaskRunnerCallable.callInternal(TezTaskRunner.java:171)
at org.apache.tez.runtime.task.TezTaskRunner$TaskRunnerCallable.callInternal(TezTaskRunner.java:167)
at org.apache.tez.common.CallableWithNdc.call(CallableWithNdc.java:36)
at java.util.concurrent.FutureTask.run(FutureTask.java:262)
at java.util.concurrent.ThreadPoolExecutor.runWorker(ThreadPoolExecutor.java:1145)
at java.util.concurrent.ThreadPoolExecutor$Worker.run(ThreadPoolExecutor.java:615)
at java.lang.Thread.run(Thread.java:745)
Caused by: java.lang.ClassNotFoundException: com.teradata.sddg.sgprocessor.TezDataGeneratorTest$DataGenerationProcessor
at java.net.URLClassLoader$1.run(URLClassLoader.java:366)
at java.net.URLClassLoader$1.run(URLClassLoader.java:355)
at java.security.AccessController.doPrivileged(Native Method)
at java.net.URLClassLoader.findClass(URLClassLoader.java:354)
at java.lang.ClassLoader.loadClass(ClassLoader.java:425)
at sun.misc.Launcher$AppClassLoader.loadClass(Launcher.java:308)
at java.lang.ClassLoader.loadClass(ClassLoader.java:358)
at java.lang.Class.forName0(Native Method)
at java.lang.Class.forName(Class.java:274)
at org.apache.tez.common.ReflectionUtils.getClazz(ReflectionUtils.java:43)
... 15 more
Vertex did not succeed due to OWN_TASK_FAILURE, failedTasks:1 killedTasks:0, Vertex vertex_1452667827400_0022_1_00
 ASSOCIATE
killed/failed due to:null

Vertex killed, vertexName=SALES_TRANSACTION, vertexId=vertex_1452667827400_0022_1_01, diagnostics=
 Vertex received Kill while in RUNNING state., Vertex did not succeed due to OTHER_VERTEX_FAILURE,
failedTasks:0 killedTasks:1, Vertex vertex_1452667827400_0022_1_01
 SALES_TRANSACTION
killed/failed due to:null

DAG did not succeed due to VERTEX_FAILURE. failedVertices:1 killedVertices:1



--
This message was sent by Atlassian JIRA
(v6.3.4#6332)

Mime
View raw message