tez-dev mailing list archives

Site index · List index
Message view « Date » · « Thread »
Top « Date » · « Thread »
From Apache Jenkins Server <jenk...@builds.apache.org>
Subject Build failed in Jenkins: Tez-Build-branch-0.7 #141
Date Tue, 05 Apr 2016 16:50:02 GMT
See <https://builds.apache.org/job/Tez-Build-branch-0.7/141/changes>

Changes:

[hitesh] TEZ-3177. Non-DAG events should use the session domain or no domain if

[hitesh] TEZ-3177. Addendum patch. Non-DAG events should use the session domain

------------------------------------------
[...truncated 1943 lines...]
[INFO] --- build-helper-maven-plugin:1.8:maven-version (maven-version) @ tez-perf-analyzer
---
[INFO] 
[INFO] --- maven-jar-plugin:2.4:test-jar (default) @ tez-perf-analyzer ---
[WARNING] JAR will be empty - no content was marked for inclusion!
[INFO]                                                                         
[INFO] ------------------------------------------------------------------------
[INFO] Building tez-job-analyzer 0.7.1-SNAPSHOT
[INFO] ------------------------------------------------------------------------
[INFO] 
[INFO] --- maven-clean-plugin:2.5:clean (default-clean) @ tez-job-analyzer ---
[INFO] 
[INFO] --- buildnumber-maven-plugin:1.1:create (default) @ tez-job-analyzer ---
[INFO] Checking for local modifications: skipped.
[INFO] Updating project files from SCM: skipped.
[INFO] Executing: /bin/sh -c cd <https://builds.apache.org/job/Tez-Build-branch-0.7/ws/tez-tools/analyzers/job-analyzer>
&& git rev-parse --verify HEAD
[INFO] Working directory: <https://builds.apache.org/job/Tez-Build-branch-0.7/ws/tez-tools/analyzers/job-analyzer>
[INFO] Storing buildNumber: d2695adf50d63128505995477720d78ef1ecd289 at timestamp: 1459875003585
[INFO] Executing: /bin/sh -c cd <https://builds.apache.org/job/Tez-Build-branch-0.7/ws/tez-tools/analyzers/job-analyzer>
&& git rev-parse --verify HEAD
[INFO] Working directory: <https://builds.apache.org/job/Tez-Build-branch-0.7/ws/tez-tools/analyzers/job-analyzer>
[INFO] Storing buildScmBranch: UNKNOWN
[INFO] 
[INFO] --- build-helper-maven-plugin:1.8:maven-version (maven-version) @ tez-job-analyzer
---
[INFO] 
[INFO] --- maven-resources-plugin:2.6:resources (default-resources) @ tez-job-analyzer ---
[INFO] Using 'UTF-8' encoding to copy filtered resources.
[INFO] skip non existing resourceDirectory <https://builds.apache.org/job/Tez-Build-branch-0.7/ws/tez-tools/analyzers/job-analyzer/src/main/resources>
[INFO] 
[INFO] --- maven-compiler-plugin:3.1:compile (default-compile) @ tez-job-analyzer ---
[INFO] Changes detected - recompiling the module!
[INFO] Compiling 18 source files to <https://builds.apache.org/job/Tez-Build-branch-0.7/ws/tez-tools/analyzers/job-analyzer/target/classes>
[INFO] 
[INFO] --- maven-resources-plugin:2.6:testResources (default-testResources) @ tez-job-analyzer
---
[INFO] Using 'UTF-8' encoding to copy filtered resources.
[INFO] skip non existing resourceDirectory <https://builds.apache.org/job/Tez-Build-branch-0.7/ws/tez-tools/analyzers/job-analyzer/src/test/resources>
[INFO] 
[INFO] --- maven-compiler-plugin:3.1:testCompile (default-testCompile) @ tez-job-analyzer
---
[INFO] Changes detected - recompiling the module!
[INFO] Compiling 1 source file to <https://builds.apache.org/job/Tez-Build-branch-0.7/ws/tez-tools/analyzers/job-analyzer/target/test-classes>
[INFO] 
[INFO] --- maven-surefire-plugin:2.14.1:test (default-test) @ tez-job-analyzer ---
[INFO] Tests are skipped.
[INFO] 
[INFO] --- buildnumber-maven-plugin:1.1:create (default) @ tez-job-analyzer ---
[INFO] Checking for local modifications: skipped.
[INFO] Updating project files from SCM: skipped.
[INFO] Executing: /bin/sh -c cd <https://builds.apache.org/job/Tez-Build-branch-0.7/ws/tez-tools/analyzers/job-analyzer>
&& git rev-parse --verify HEAD
[INFO] Working directory: <https://builds.apache.org/job/Tez-Build-branch-0.7/ws/tez-tools/analyzers/job-analyzer>
[INFO] Storing buildNumber: d2695adf50d63128505995477720d78ef1ecd289 at timestamp: 1459875003825
[INFO] Executing: /bin/sh -c cd <https://builds.apache.org/job/Tez-Build-branch-0.7/ws/tez-tools/analyzers/job-analyzer>
&& git rev-parse --verify HEAD
[INFO] Working directory: <https://builds.apache.org/job/Tez-Build-branch-0.7/ws/tez-tools/analyzers/job-analyzer>
[INFO] Storing buildScmBranch: UNKNOWN
[INFO] 
[INFO] --- build-helper-maven-plugin:1.8:maven-version (maven-version) @ tez-job-analyzer
---
[INFO] 
[INFO] --- maven-resources-plugin:2.6:resources (default-resources) @ tez-job-analyzer ---
[INFO] Using 'UTF-8' encoding to copy filtered resources.
[INFO] skip non existing resourceDirectory <https://builds.apache.org/job/Tez-Build-branch-0.7/ws/tez-tools/analyzers/job-analyzer/src/main/resources>
[INFO] 
[INFO] --- maven-compiler-plugin:3.1:compile (default-compile) @ tez-job-analyzer ---
[INFO] Nothing to compile - all classes are up to date
[INFO] 
[INFO] --- maven-resources-plugin:2.6:testResources (default-testResources) @ tez-job-analyzer
---
[INFO] Using 'UTF-8' encoding to copy filtered resources.
[INFO] skip non existing resourceDirectory <https://builds.apache.org/job/Tez-Build-branch-0.7/ws/tez-tools/analyzers/job-analyzer/src/test/resources>
[INFO] 
[INFO] --- maven-compiler-plugin:3.1:testCompile (default-testCompile) @ tez-job-analyzer
---
[INFO] Nothing to compile - all classes are up to date
[INFO] 
[INFO] --- maven-surefire-plugin:2.14.1:test (default-test) @ tez-job-analyzer ---
[INFO] Tests are skipped.
[INFO] 
[INFO] --- maven-jar-plugin:2.4:jar (default-jar) @ tez-job-analyzer ---
[INFO] Building jar: <https://builds.apache.org/job/Tez-Build-branch-0.7/ws/tez-tools/analyzers/job-analyzer/target/tez-job-analyzer-0.7.1-SNAPSHOT.jar>
[INFO] 
[INFO] --- maven-jar-plugin:2.4:test-jar (default) @ tez-job-analyzer ---
[INFO] Building jar: <https://builds.apache.org/job/Tez-Build-branch-0.7/ws/tez-tools/analyzers/job-analyzer/target/tez-job-analyzer-0.7.1-SNAPSHOT-tests.jar>
[INFO] 
[INFO] --- maven-install-plugin:2.4:install (default-install) @ tez-job-analyzer ---
[INFO] Installing <https://builds.apache.org/job/Tez-Build-branch-0.7/ws/tez-tools/analyzers/job-analyzer/target/tez-job-analyzer-0.7.1-SNAPSHOT.jar>
to /home/jenkins/.m2/repository/org/apache/tez/tez-job-analyzer/0.7.1-SNAPSHOT/tez-job-analyzer-0.7.1-SNAPSHOT.jar
[INFO] Installing <https://builds.apache.org/job/Tez-Build-branch-0.7/ws/tez-tools/analyzers/job-analyzer/pom.xml>
to /home/jenkins/.m2/repository/org/apache/tez/tez-job-analyzer/0.7.1-SNAPSHOT/tez-job-analyzer-0.7.1-SNAPSHOT.pom
[INFO] Installing <https://builds.apache.org/job/Tez-Build-branch-0.7/ws/tez-tools/analyzers/job-analyzer/target/tez-job-analyzer-0.7.1-SNAPSHOT-tests.jar>
to /home/jenkins/.m2/repository/org/apache/tez/tez-job-analyzer/0.7.1-SNAPSHOT/tez-job-analyzer-0.7.1-SNAPSHOT-tests.jar
[INFO] 
[INFO] --- maven-deploy-plugin:2.8.1:deploy (default-deploy) @ tez-job-analyzer ---
[INFO] Deploying org.apache.tez:tez-job-analyzer:0.7.1-SNAPSHOT at end
[INFO] 
[INFO] --- buildnumber-maven-plugin:1.1:create (default) @ tez-job-analyzer ---
[INFO] Checking for local modifications: skipped.
[INFO] Updating project files from SCM: skipped.
[INFO] Executing: /bin/sh -c cd <https://builds.apache.org/job/Tez-Build-branch-0.7/ws/tez-tools/analyzers/job-analyzer>
&& git rev-parse --verify HEAD
[INFO] Working directory: <https://builds.apache.org/job/Tez-Build-branch-0.7/ws/tez-tools/analyzers/job-analyzer>
[INFO] Storing buildNumber: d2695adf50d63128505995477720d78ef1ecd289 at timestamp: 1459875003965
[INFO] Executing: /bin/sh -c cd <https://builds.apache.org/job/Tez-Build-branch-0.7/ws/tez-tools/analyzers/job-analyzer>
&& git rev-parse --verify HEAD
[INFO] Working directory: <https://builds.apache.org/job/Tez-Build-branch-0.7/ws/tez-tools/analyzers/job-analyzer>
[INFO] Storing buildScmBranch: UNKNOWN
[INFO] 
[INFO] --- build-helper-maven-plugin:1.8:maven-version (maven-version) @ tez-job-analyzer
---
[INFO] 
[INFO] --- maven-resources-plugin:2.6:resources (default-resources) @ tez-job-analyzer ---
[INFO] Using 'UTF-8' encoding to copy filtered resources.
[INFO] skip non existing resourceDirectory <https://builds.apache.org/job/Tez-Build-branch-0.7/ws/tez-tools/analyzers/job-analyzer/src/main/resources>
[INFO] 
[INFO] --- maven-compiler-plugin:3.1:compile (default-compile) @ tez-job-analyzer ---
[INFO] Nothing to compile - all classes are up to date
[INFO] 
[INFO] --- maven-resources-plugin:2.6:testResources (default-testResources) @ tez-job-analyzer
---
[INFO] Using 'UTF-8' encoding to copy filtered resources.
[INFO] skip non existing resourceDirectory <https://builds.apache.org/job/Tez-Build-branch-0.7/ws/tez-tools/analyzers/job-analyzer/src/test/resources>
[INFO] 
[INFO] --- maven-compiler-plugin:3.1:testCompile (default-testCompile) @ tez-job-analyzer
---
[INFO] Nothing to compile - all classes are up to date
[INFO] 
[INFO] --- maven-surefire-plugin:2.14.1:test (default-test) @ tez-job-analyzer ---
[INFO] Tests are skipped.
[INFO] 
[INFO] --- maven-jar-plugin:2.4:jar (default-jar) @ tez-job-analyzer ---
[INFO] 
[INFO] --- maven-jar-plugin:2.4:test-jar (default) @ tez-job-analyzer ---
[INFO]                                                                         
[INFO] ------------------------------------------------------------------------
[INFO] Building tez-dist 0.7.1-SNAPSHOT
[INFO] ------------------------------------------------------------------------
[INFO] 
[INFO] --- maven-clean-plugin:2.5:clean (default-clean) @ tez-dist ---
[INFO] 
[INFO] --- buildnumber-maven-plugin:1.1:create (default) @ tez-dist ---
[INFO] Checking for local modifications: skipped.
[INFO] Updating project files from SCM: skipped.
[INFO] Executing: /bin/sh -c cd <https://builds.apache.org/job/Tez-Build-branch-0.7/ws/tez-dist>
&& git rev-parse --verify HEAD
[INFO] Working directory: <https://builds.apache.org/job/Tez-Build-branch-0.7/ws/tez-dist>
[INFO] Storing buildNumber: d2695adf50d63128505995477720d78ef1ecd289 at timestamp: 1459875004060
[INFO] Executing: /bin/sh -c cd <https://builds.apache.org/job/Tez-Build-branch-0.7/ws/tez-dist>
&& git rev-parse --verify HEAD
[INFO] Working directory: <https://builds.apache.org/job/Tez-Build-branch-0.7/ws/tez-dist>
[INFO] Storing buildScmBranch: UNKNOWN
[INFO] 
[INFO] --- build-helper-maven-plugin:1.8:maven-version (maven-version) @ tez-dist ---
[INFO] 
[INFO] --- buildnumber-maven-plugin:1.1:create (default) @ tez-dist ---
[INFO] Checking for local modifications: skipped.
[INFO] Updating project files from SCM: skipped.
[INFO] Executing: /bin/sh -c cd <https://builds.apache.org/job/Tez-Build-branch-0.7/ws/tez-dist>
&& git rev-parse --verify HEAD
[INFO] Working directory: <https://builds.apache.org/job/Tez-Build-branch-0.7/ws/tez-dist>
[INFO] Storing buildNumber: d2695adf50d63128505995477720d78ef1ecd289 at timestamp: 1459875004070
[INFO] Executing: /bin/sh -c cd <https://builds.apache.org/job/Tez-Build-branch-0.7/ws/tez-dist>
&& git rev-parse --verify HEAD
[INFO] Working directory: <https://builds.apache.org/job/Tez-Build-branch-0.7/ws/tez-dist>
[INFO] Storing buildScmBranch: UNKNOWN
[INFO] 
[INFO] --- build-helper-maven-plugin:1.8:maven-version (maven-version) @ tez-dist ---
[INFO] 
[INFO] --- maven-assembly-plugin:2.4:single (package-tez) @ tez-dist ---
[INFO] Reading assembly descriptor: src/main/assembly/tez-dist.xml
[INFO]                                                                         
[INFO] ------------------------------------------------------------------------
[INFO] Building Tez 0.7.1-SNAPSHOT
[INFO] ------------------------------------------------------------------------
[INFO] 
[INFO] --- maven-clean-plugin:2.5:clean (default-clean) @ tez-docs ---
[INFO] 
[INFO] --- buildnumber-maven-plugin:1.1:create (default) @ tez-docs ---
[INFO] Checking for local modifications: skipped.
[INFO] Updating project files from SCM: skipped.
[INFO] Executing: /bin/sh -c cd <https://builds.apache.org/job/Tez-Build-branch-0.7/ws/docs>
&& git rev-parse --verify HEAD
[INFO] Working directory: <https://builds.apache.org/job/Tez-Build-branch-0.7/ws/docs>
[INFO] Storing buildNumber: d2695adf50d63128505995477720d78ef1ecd289 at timestamp: 1459875004313
[INFO] Executing: /bin/sh -c cd <https://builds.apache.org/job/Tez-Build-branch-0.7/ws/docs>
&& git rev-parse --verify HEAD
[INFO] Working directory: <https://builds.apache.org/job/Tez-Build-branch-0.7/ws/docs>
[INFO] Storing buildScmBranch: UNKNOWN
[INFO] 
[INFO] --- build-helper-maven-plugin:1.8:maven-version (maven-version) @ tez-docs ---
[INFO] 
[INFO] --- buildnumber-maven-plugin:1.1:create (default) @ tez-docs ---
[INFO] Checking for local modifications: skipped.
[INFO] Updating project files from SCM: skipped.
[INFO] Executing: /bin/sh -c cd <https://builds.apache.org/job/Tez-Build-branch-0.7/ws/docs>
&& git rev-parse --verify HEAD
[INFO] Working directory: <https://builds.apache.org/job/Tez-Build-branch-0.7/ws/docs>
[INFO] Storing buildNumber: d2695adf50d63128505995477720d78ef1ecd289 at timestamp: 1459875004322
[INFO] Executing: /bin/sh -c cd <https://builds.apache.org/job/Tez-Build-branch-0.7/ws/docs>
&& git rev-parse --verify HEAD
[INFO] Working directory: <https://builds.apache.org/job/Tez-Build-branch-0.7/ws/docs>
[INFO] Storing buildScmBranch: UNKNOWN
[INFO] 
[INFO] --- build-helper-maven-plugin:1.8:maven-version (maven-version) @ tez-docs ---
[INFO] 
[INFO] --- maven-jar-plugin:2.4:test-jar (default) @ tez-docs ---
[WARNING] JAR will be empty - no content was marked for inclusion!
[INFO] Building jar: <https://builds.apache.org/job/Tez-Build-branch-0.7/ws/docs/target/tez-docs-0.7.1-SNAPSHOT-tests.jar>
[INFO] 
[INFO] --- maven-install-plugin:2.4:install (default-install) @ tez-docs ---
[INFO] Installing <https://builds.apache.org/job/Tez-Build-branch-0.7/ws/docs/pom.xml>
to /home/jenkins/.m2/repository/org/apache/tez/tez-docs/0.7.1-SNAPSHOT/tez-docs-0.7.1-SNAPSHOT.pom
[INFO] Installing <https://builds.apache.org/job/Tez-Build-branch-0.7/ws/docs/target/tez-docs-0.7.1-SNAPSHOT-tests.jar>
to /home/jenkins/.m2/repository/org/apache/tez/tez-docs/0.7.1-SNAPSHOT/tez-docs-0.7.1-SNAPSHOT-tests.jar
[INFO] 
[INFO] --- maven-deploy-plugin:2.8.1:deploy (default-deploy) @ tez-docs ---
[INFO] Skipping artifact deployment
[INFO] 
[INFO] --- buildnumber-maven-plugin:1.1:create (default) @ tez-docs ---
[INFO] Checking for local modifications: skipped.
[INFO] Updating project files from SCM: skipped.
[INFO] Executing: /bin/sh -c cd <https://builds.apache.org/job/Tez-Build-branch-0.7/ws/docs>
&& git rev-parse --verify HEAD
[INFO] Working directory: <https://builds.apache.org/job/Tez-Build-branch-0.7/ws/docs>
[INFO] Storing buildNumber: d2695adf50d63128505995477720d78ef1ecd289 at timestamp: 1459875004384
[INFO] Executing: /bin/sh -c cd <https://builds.apache.org/job/Tez-Build-branch-0.7/ws/docs>
&& git rev-parse --verify HEAD
[INFO] Working directory: <https://builds.apache.org/job/Tez-Build-branch-0.7/ws/docs>
[INFO] Storing buildScmBranch: UNKNOWN
[INFO] 
[INFO] --- build-helper-maven-plugin:1.8:maven-version (maven-version) @ tez-docs ---
[INFO] 
[INFO] --- maven-jar-plugin:2.4:test-jar (default) @ tez-docs ---
[WARNING] JAR will be empty - no content was marked for inclusion!
[INFO] ------------------------------------------------------------------------
[INFO] Reactor Summary:
[INFO] 
[INFO] tez ............................................... SUCCESS [  1.251 s]
[INFO] tez-api ........................................... SUCCESS [ 15.288 s]
[INFO] tez-common ........................................ SUCCESS [  0.567 s]
[INFO] tez-runtime-internals ............................. SUCCESS [  0.867 s]
[INFO] tez-runtime-library ............................... SUCCESS [  3.518 s]
[INFO] tez-mapreduce ..................................... SUCCESS [  1.549 s]
[INFO] tez-examples ...................................... SUCCESS [  0.385 s]
[INFO] tez-dag ........................................... SUCCESS [  6.735 s]
[INFO] tez-tests ......................................... SUCCESS [  1.001 s]
[INFO] tez-ui ............................................ FAILURE [  6.068 s]
[INFO] tez-plugins ....................................... SUCCESS [  0.107 s]
[INFO] tez-yarn-timeline-history ......................... SUCCESS [  0.584 s]
[INFO] tez-yarn-timeline-history-with-acls ............... SUCCESS [  0.387 s]
[INFO] tez-history-parser ................................ SUCCESS [ 26.945 s]
[INFO] tez-tools ......................................... SUCCESS [  0.155 s]
[INFO] tez-perf-analyzer ................................. SUCCESS [  0.162 s]
[INFO] tez-job-analyzer .................................. SUCCESS [  0.569 s]
[INFO] tez-dist .......................................... FAILURE [  0.291 s]
[INFO] Tez ............................................... SUCCESS [  0.084 s]
[INFO] ------------------------------------------------------------------------
[INFO] BUILD FAILURE
[INFO] ------------------------------------------------------------------------
[INFO] Total time: 01:07 min
[INFO] Finished at: 2016-04-05T16:50:04+00:00
[INFO] Final Memory: 94M/1104M
[INFO] ------------------------------------------------------------------------
[ERROR] Failed to execute goal com.github.eirslett:frontend-maven-plugin:0.0.23:npm (npm install)
on project tez-ui: Failed to run task: 'npm install --color=false' failed. (error code 1)
-> [Help 1]
[ERROR] Failed to execute goal org.apache.maven.plugins:maven-assembly-plugin:2.4:single (package-tez)
on project tez-dist: Failed to create assembly: Artifact: org.apache.tez:tez-ui:war:0.7.1-SNAPSHOT
(included by module) does not have an artifact with a file. Please ensure the package phase
is run before the assembly is generated. -> [Help 2]
[ERROR] 
[ERROR] To see the full stack trace of the errors, re-run Maven with the -e switch.
[ERROR] Re-run Maven using the -X switch to enable full debug logging.
[ERROR] 
[ERROR] For more information about the errors and possible solutions, please read the following
articles:
[ERROR] [Help 1] http://cwiki.apache.org/confluence/display/MAVEN/MojoFailureException
[ERROR] [Help 2] http://cwiki.apache.org/confluence/display/MAVEN/MojoExecutionException
[ERROR] 
[ERROR] After correcting the problems, you can resume the build with the command
[ERROR]   mvn <goals> -rf :tez-ui
Build step 'Execute shell' marked build as failure
Archiving artifacts

Mime
View raw message