thrift-user mailing list archives

Site index · List index
Message view « Date » · « Thread »
Top « Date » · « Thread »
From Jake Farrell <jfarr...@apache.org>
Subject Re: error message when installing thrift 0.9.0
Date Tue, 23 Oct 2012 12:08:42 GMT
did you install glib2.0? what does your configure line look like and what
is the output when you run configure

Thanks
Jake



On Tue, Oct 23, 2012 at 4:37 AM, huaxiang <huaxiang@asiainfo-linkage.com>wrote:

>
>
>
>
> Hi,
>
>    below is the 'make check' error messages when installing thrift 0.9 on
> redhat 6.1system.
>
>
>
> PASS: testthrifttestclient
> ====================
> 1 of 11 tests failed
> ====================
> make[5]: *** [check-TESTS] error  1
> make[5]: Leaving directory `/hadoop0/thrift-0.9.0/lib/c_glib/test'
> make[4]: *** [check-am] error 2
> make[4]: Leaving directory `/hadoop0/thrift-0.9.0/lib/c_glib/test'
> make[3]: *** [check-recursive]  error 1
> make[3]: Leaving directory `/hadoop0/thrift-0.9.0/lib/c_glib/test'
> make[2]: *** [check-recursive]  error 1
> make[2]: Leaving directory `/hadoop0/thrift-0.9.0/lib/c_glib'
> make[1]: *** [check-recursive]  error 1
> make[1]: Leaving directory `/hadoop0/thrift-0.9.0/lib'
> make: *** [check-recursive]  error 1
> [root@hadoop2 thrift-0.9.
>
> beatls
>
>

Mime
  • Unnamed multipart/alternative (inline, None, 0 bytes)
View raw message