tuscany-commits mailing list archives

Site index · List index
Message view « Date » · « Thread »
Top « Date » · « Thread »
From Apache Hudson Server <hud...@hudson.zones.apache.org>
Subject Build failed in Hudson: Tuscany-2x #372
Date Tue, 05 Jan 2010 19:21:42 GMT
See <http://hudson.zones.apache.org/hudson/job/Tuscany-2x/372/changes>

Changes:

[antelder] Add some explicit plugin versions and activate the maven enforcer plugin to verify
only explicit released plugin versions are being used in the build to try to ensure the build
runs consistently

[antelder] Add explicit plugin versions

[antelder] Add explicit plugin version

------------------------------------------
[...truncated 18550 lines...]
[WARNING] Using platform encoding (UTF-8 actually) to copy filtered resources, i.e. build
is platform dependent!
[INFO] skip non existing resourceDirectory <http://hudson.zones.apache.org/hudson/job/Tuscany-2x/ws/sca-2x/shades/base/src/main/resources>
[INFO] Copying 0 resource
[INFO] [compiler:compile {execution: default-compile}]
[INFO] No sources to compile
[INFO] [resources:testResources {execution: default-testResources}]
[WARNING] Using platform encoding (UTF-8 actually) to copy filtered resources, i.e. build
is platform dependent!
[INFO] skip non existing resourceDirectory <http://hudson.zones.apache.org/hudson/job/Tuscany-2x/ws/sca-2x/shades/base/src/test/resources>
[INFO] [compiler:testCompile {execution: default-testCompile}]
[INFO] No sources to compile
[INFO] [surefire:test {execution: default-test}]
[INFO] No tests to run.
[HUDSON] Recording test results
[INFO] [jar:jar {execution: default-jar}]
[INFO] Building jar: <http://hudson.zones.apache.org/hudson/job/Tuscany-2x/ws/sca-2x/shades/base/target/tuscany-base-2.0-SNAPSHOT.jar>
[INFO] [shade:shade {execution: default}]
[INFO] Including org.apache.tuscany.sca:tuscany-domain-node:jar:2.0-SNAPSHOT in the shaded
jar.
[INFO] Including org.apache.tuscany.sca:tuscany-node-impl:jar:2.0-SNAPSHOT in the shaded jar.
[INFO] Including org.apache.tuscany.sca:tuscany-assembly:jar:2.0-SNAPSHOT in the shaded jar.
[INFO] Including org.apache.tuscany.sca:tuscany-monitor:jar:2.0-SNAPSHOT in the shaded jar.
[INFO] Including org.apache.tuscany.sca:tuscany-extensibility:jar:2.0-SNAPSHOT in the shaded
jar.
[INFO] Including org.apache.tuscany.sca:tuscany-contribution:jar:2.0-SNAPSHOT in the shaded
jar.
[INFO] Including org.apache.tuscany.sca:tuscany-assembly-xsd:jar:2.0-SNAPSHOT in the shaded
jar.
[INFO] Including org.apache.tuscany.sca:tuscany-common-xml:jar:2.0-SNAPSHOT in the shaded
jar.
[INFO] Including org.apache.tuscany.sca:tuscany-common-java:jar:2.0-SNAPSHOT in the shaded
jar.
[INFO] Including org.apache.tuscany.sca:tuscany-sca-api:jar:2.0-SNAPSHOT in the shaded jar.
[INFO] Including org.apache.tuscany.sca:tuscany-node-api:jar:2.0-SNAPSHOT in the shaded jar.
[INFO] Including org.apache.tuscany.sca:tuscany-core:jar:2.0-SNAPSHOT in the shaded jar.
[INFO] Including org.apache.tuscany.sca:tuscany-core-spi:jar:2.0-SNAPSHOT in the shaded jar.
[INFO] Including org.apache.tuscany.sca:tuscany-interface-java:jar:2.0-SNAPSHOT in the shaded
jar.
[INFO] Including cglib:cglib:jar:2.2 in the shaded jar.
[INFO] Including asm:asm:jar:3.1 in the shaded jar.
[INFO] Including org.apache.tuscany.sca:tuscany-assembly-xml:jar:2.0-SNAPSHOT in the shaded
jar.
[INFO] Including org.apache.tuscany.sca:tuscany-deployment:jar:2.0-SNAPSHOT in the shaded
jar.
[INFO] Including org.apache.tuscany.sca:tuscany-builder:jar:2.0-SNAPSHOT in the shaded jar.
[INFO] Including org.apache.tuscany.sca:tuscany-binding-sca-runtime:jar:2.0-SNAPSHOT in the
shaded jar.
[INFO] Including org.apache.tuscany.sca:tuscany-core-databinding:jar:2.0-SNAPSHOT in the shaded
jar.
[INFO] Including org.apache.tuscany.sca:tuscany-databinding:jar:2.0-SNAPSHOT in the shaded
jar.
[INFO] Including org.apache.tuscany.sca:tuscany-xsd:jar:2.0-SNAPSHOT in the shaded jar.
[INFO] Including org.apache.ws.commons.schema:XmlSchema:jar:1.4.2 in the shaded jar.
[INFO] Including org.apache.tuscany.sca:tuscany-databinding-jaxb:jar:2.0-SNAPSHOT in the shaded
jar.
[INFO] Including org.apache.tuscany.sca:tuscany-interface-java-jaxws:jar:2.0-SNAPSHOT in the
shaded jar.
[INFO] Including org.apache.tuscany.sca:tuscany-sca-client-rmi:jar:2.0-SNAPSHOT in the shaded
jar.
[INFO] Including org.apache.tuscany.sca:tuscany-binding-sca-runtime-rmi:jar:2.0-SNAPSHOT in
the shaded jar.
[INFO] Including org.apache.tuscany.sca:tuscany-binding-rmi-runtime:jar:2.0-SNAPSHOT in the
shaded jar.
[INFO] Including org.apache.tuscany.sca:tuscany-binding-rmi:jar:2.0-SNAPSHOT in the shaded
jar.
[INFO] Including org.apache.tuscany.sca:tuscany-host-rmi:jar:2.0-SNAPSHOT in the shaded jar.
[INFO] Including org.apache.tuscany.sca:tuscany-endpoint-tribes:jar:2.0-SNAPSHOT in the shaded
jar.
[INFO] Including org.apache.tomcat:tribes:jar:6.0.18 in the shaded jar.
[INFO] Including org.apache.tomcat:juli:jar:6.0.18 in the shaded jar.
[INFO] Including org.apache.tuscany.sca:tuscany-implementation-java-runtime:jar:2.0-SNAPSHOT
in the shaded jar.
[INFO] Including org.apache.tuscany.sca:tuscany-implementation-java:jar:2.0-SNAPSHOT in the
shaded jar.
[INFO] Including org.apache.tuscany.sca:tuscany-implementation-web-runtime:jar:2.0-SNAPSHOT
in the shaded jar.
[INFO] Including org.apache.tuscany.sca:tuscany-implementation-web:jar:2.0-SNAPSHOT in the
shaded jar.
[INFO] Including org.apache.tuscany.sca:tuscany-host-webapp:jar:2.0-SNAPSHOT in the shaded
jar.
[INFO] Including org.apache.tuscany.sca:tuscany-host-http:jar:2.0-SNAPSHOT in the shaded jar.
[INFO] Including org.apache.tuscany.sca:tuscany-launcher:jar:2.0-SNAPSHOT in the shaded jar.
[INFO] Including org.apache.tuscany.sca:tuscany-sca-client-javascript:jar:2.0-SNAPSHOT in
the shaded jar.
[INFO] Including org.apache.tuscany.sca:tuscany-binding-jms-runtime:jar:2.0-SNAPSHOT in the
shaded jar.
[INFO] Including org.apache.tuscany.sca:tuscany-binding-jms:jar:2.0-SNAPSHOT in the shaded
jar.
[INFO] Including org.apache.tuscany.sca:tuscany-policy-security:jar:2.0-SNAPSHOT in the shaded
jar.
[INFO] Including org.apache.tuscany.sca:tuscany-host-jetty:jar:2.0-SNAPSHOT in the shaded
jar.
[INFO] Replacing original artifact with shaded artifact.
[INFO] Replacing <http://hudson.zones.apache.org/hudson/job/Tuscany-2x/ws/sca-2x/shades/base/target/tuscany-base-2.0-SNAPSHOT.jar>
with <http://hudson.zones.apache.org/hudson/job/Tuscany-2x/ws/sca-2x/shades/base/target/tuscany-base-2.0-SNAPSHOT-shaded.jar>
[INFO] [install:install {execution: default-install}]
[INFO] Installing <http://hudson.zones.apache.org/hudson/job/Tuscany-2x/ws/sca-2x/shades/base/target/tuscany-base-2.0-SNAPSHOT.jar>
to /home/hudson/.m2/repository/org/apache/tuscany/sca/tuscany-base/2.0-SNAPSHOT/tuscany-base-2.0-SNAPSHOT.jar
[HUDSON] Archiving <http://hudson.zones.apache.org/hudson/job/Tuscany-2x/ws/sca-2x/shades/base/dependency-reduced-pom.xml>
to /export/home/hudson/hudson/jobs/Tuscany-2x/modules/org.apache.tuscany.sca$tuscany-base/builds/2010-01-05_18-38-56/archive/org.apache.tuscany.sca/tuscany-base/2.0-SNAPSHOT/dependency-reduced-pom.xml
[HUDSON] Archiving <http://hudson.zones.apache.org/hudson/job/Tuscany-2x/ws/sca-2x/shades/base/target/tuscany-base-2.0-SNAPSHOT.jar>
to /export/home/hudson/hudson/jobs/Tuscany-2x/modules/org.apache.tuscany.sca$tuscany-base/builds/2010-01-05_18-38-56/archive/org.apache.tuscany.sca/tuscany-base/2.0-SNAPSHOT/tuscany-base-2.0-SNAPSHOT.jar
[INFO] ------------------------------------------------------------------------
[INFO] Building Apache Tuscany SCA Web Services Jar
[INFO]    task-segment: [clean, install]
[INFO] ------------------------------------------------------------------------
[INFO] [clean:clean {execution: default-clean}]
[INFO] Deleting file set: <http://hudson.zones.apache.org/hudson/job/Tuscany-2x/ws/sca-2x/shades/webservices/target>
(included: [**], excluded: [])
[INFO] [enforcer:enforce {execution: enforce-plugin-versions}]
[INFO] [resources:resources {execution: default-resources}]
[WARNING] Using platform encoding (UTF-8 actually) to copy filtered resources, i.e. build
is platform dependent!
[INFO] skip non existing resourceDirectory <http://hudson.zones.apache.org/hudson/job/Tuscany-2x/ws/sca-2x/shades/webservices/src/main/resources>
[INFO] Copying 0 resource
[INFO] [compiler:compile {execution: default-compile}]
[INFO] No sources to compile
[INFO] [resources:testResources {execution: default-testResources}]
[WARNING] Using platform encoding (UTF-8 actually) to copy filtered resources, i.e. build
is platform dependent!
[INFO] skip non existing resourceDirectory <http://hudson.zones.apache.org/hudson/job/Tuscany-2x/ws/sca-2x/shades/webservices/src/test/resources>
[INFO] [compiler:testCompile {execution: default-testCompile}]
[INFO] No sources to compile
[INFO] [surefire:test {execution: default-test}]
[INFO] No tests to run.
[HUDSON] Recording test results
[INFO] [jar:jar {execution: default-jar}]
[INFO] Building jar: <http://hudson.zones.apache.org/hudson/job/Tuscany-2x/ws/sca-2x/shades/webservices/target/tuscany-webservices-2.0-SNAPSHOT.jar>
[INFO] [shade:shade {execution: default}]
[INFO] Including org.apache.tuscany.sca:tuscany-binding-ws-axis2:jar:2.0-SNAPSHOT in the shaded
jar.
[INFO] Including org.apache.tuscany.sca:tuscany-interface-wsdl:jar:2.0-SNAPSHOT in the shaded
jar.
[INFO] Including wsdl4j:wsdl4j:jar:1.6.2 in the shaded jar.
[INFO] Including org.apache.tuscany.sca:tuscany-binding-ws:jar:2.0-SNAPSHOT in the shaded
jar.
[INFO] Including org.apache.tuscany.sca:tuscany-binding-ws-wsdlgen:jar:2.0-SNAPSHOT in the
shaded jar.
[INFO] Including org.apache.tuscany.sca:tuscany-databinding-axiom:jar:2.0-SNAPSHOT in the
shaded jar.
[INFO] Including org.apache.ws.commons.axiom:axiom-api:jar:1.2.7 in the shaded jar.
[INFO] Including org.apache.geronimo.specs:geronimo-javamail_1.4_spec:jar:1.2 in the shaded
jar.
[INFO] Including commons-logging:commons-logging:jar:1.1.1 in the shaded jar.
[INFO] Including org.apache.ws.commons.axiom:axiom-impl:jar:1.2.7 in the shaded jar.
[INFO] Including org.apache.tuscany.sca:tuscany-databinding-jaxb-axiom:jar:2.0-SNAPSHOT in
the shaded jar.
[INFO] Including org.apache.tuscany.sca:tuscany-binding-ws-axis2-policy:jar:2.0-SNAPSHOT in
the shaded jar.
[INFO] Including org.apache.tuscany.sca:tuscany-policy-security:jar:2.0-SNAPSHOT in the shaded
jar.
[INFO] Including org.apache.axis2:axis2-kernel:jar:1.4.1 in the shaded jar.
[INFO] Including commons-httpclient:commons-httpclient:jar:3.1 in the shaded jar.
[INFO] Including commons-codec:commons-codec:jar:1.2 in the shaded jar.
[INFO] Including commons-fileupload:commons-fileupload:jar:1.2 in the shaded jar.
[INFO] Including org.apache.httpcomponents:httpcore:jar:4.0.1 in the shaded jar.
[INFO] Including org.apache.httpcomponents:httpcore-nio:jar:4.0.1 in the shaded jar.
[INFO] Including org.apache.neethi:neethi:jar:2.0.4 in the shaded jar.
[INFO] Including org.apache.woden:woden-api:jar:1.0M8 in the shaded jar.
[INFO] Including org.apache.woden:woden-impl-dom:jar:1.0M8 in the shaded jar.
[INFO] Including annogen:annogen:jar:0.1.0 in the shaded jar.
[INFO] Including org.apache.geronimo.specs:geronimo-jms_1.1_spec:jar:1.1 in the shaded jar.
[INFO] Including org.apache.ws.commons.axiom:axiom-dom:jar:1.2.7 in the shaded jar.
[INFO] Including commons-io:commons-io:jar:1.4 in the shaded jar.
[INFO] Including org.apache.tuscany.sca:tuscany-policy-xml-ws:jar:2.0-SNAPSHOT in the shaded
jar.
[INFO] Including backport-util-concurrent:backport-util-concurrent:jar:3.1 in the shaded jar.
[INFO] Including org.apache.axis2:axis2-java2wsdl:jar:1.4.1 in the shaded jar.
[INFO] Including org.apache.axis2:axis2-codegen:jar:1.4.1 in the shaded jar.
[INFO] Including commons-collections:commons-collections:jar:3.2 in the shaded jar.
[INFO] Including commons-discovery:commons-discovery:jar:0.4 in the shaded jar.
[INFO] Including org.apache.axis2:axis2-mtompolicy:jar:1.4.1 in the shaded jar.
[INFO] Including org.apache.santuario:xmlsec:jar:1.4.2 in the shaded jar.
[INFO] Including org.apache.ws.security:wss4j:jar:1.5.4 in the shaded jar.
[INFO] Including org.apache.axis:axis-ant:jar:1.4 in the shaded jar.
[INFO] Including org.apache.axis2:mex:jar:impl:1.41 in the shaded jar.
[INFO] Including org.apache.rampart:rampart-core:jar:1.4 in the shaded jar.
[INFO] Including org.apache.rampart:rampart-policy:jar:1.4 in the shaded jar.
[INFO] Replacing original artifact with shaded artifact.
[INFO] Replacing <http://hudson.zones.apache.org/hudson/job/Tuscany-2x/ws/sca-2x/shades/webservices/target/tuscany-webservices-2.0-SNAPSHOT.jar>
with <http://hudson.zones.apache.org/hudson/job/Tuscany-2x/ws/sca-2x/shades/webservices/target/tuscany-webservices-2.0-SNAPSHOT-shaded.jar>
[INFO] [install:install {execution: default-install}]
[INFO] Installing <http://hudson.zones.apache.org/hudson/job/Tuscany-2x/ws/sca-2x/shades/webservices/target/tuscany-webservices-2.0-SNAPSHOT.jar>
to /home/hudson/.m2/repository/org/apache/tuscany/sca/tuscany-webservices/2.0-SNAPSHOT/tuscany-webservices-2.0-SNAPSHOT.jar
[HUDSON] Archiving <http://hudson.zones.apache.org/hudson/job/Tuscany-2x/ws/sca-2x/shades/webservices/dependency-reduced-pom.xml>
to /export/home/hudson/hudson/jobs/Tuscany-2x/modules/org.apache.tuscany.sca$tuscany-webservices/builds/2010-01-05_18-38-56/archive/org.apache.tuscany.sca/tuscany-webservices/2.0-SNAPSHOT/dependency-reduced-pom.xml
[HUDSON] Archiving <http://hudson.zones.apache.org/hudson/job/Tuscany-2x/ws/sca-2x/shades/webservices/target/tuscany-webservices-2.0-SNAPSHOT.jar>
to /export/home/hudson/hudson/jobs/Tuscany-2x/modules/org.apache.tuscany.sca$tuscany-webservices/builds/2010-01-05_18-38-56/archive/org.apache.tuscany.sca/tuscany-webservices/2.0-SNAPSHOT/tuscany-webservices-2.0-SNAPSHOT.jar
[INFO] ------------------------------------------------------------------------
[INFO] Building Apache Tuscany SCA Tomcat Hook
[INFO]    task-segment: [clean, install]
[INFO] ------------------------------------------------------------------------
[INFO] [clean:clean {execution: default-clean}]
[INFO] Deleting file set: <http://hudson.zones.apache.org/hudson/job/Tuscany-2x/ws/sca-2x/distribution/tomcat/tomcat-hook/target>
(included: [**], excluded: [])
[INFO] [enforcer:enforce {execution: enforce-plugin-versions}]
[INFO] snapshot org.apache.tuscany.sca:tuscany-modules:2.0-SNAPSHOT: checking for updates
from apache.snapshots
[INFO] [resources:resources {execution: default-resources}]
[WARNING] Using platform encoding (UTF-8 actually) to copy filtered resources, i.e. build
is platform dependent!
[INFO] skip non existing resourceDirectory <http://hudson.zones.apache.org/hudson/job/Tuscany-2x/ws/sca-2x/distribution/tomcat/tomcat-hook/src/main/resources>
[INFO] Copying 3 resources
[INFO] [compiler:compile {execution: default-compile}]
[INFO] Invoking Tuscany Eclipse JDT compiler
[INFO] Compiling 5 to <http://hudson.zones.apache.org/hudson/job/Tuscany-2x/ws/sca-2x/distribution/tomcat/tomcat-hook/target/classes>
[INFO] Resolving OSGi bundle: org.apache.tuscany.sca.tomcat
[ERROR] --> [org.apache.tuscany.sca.tomcat] Missing Constraint: Import-Package: org.apache.tuscany.sca.core;
version="2.0.0"
[INFO] [resources:testResources {execution: default-testResources}]
[WARNING] Using platform encoding (UTF-8 actually) to copy filtered resources, i.e. build
is platform dependent!
[INFO] skip non existing resourceDirectory <http://hudson.zones.apache.org/hudson/job/Tuscany-2x/ws/sca-2x/distribution/tomcat/tomcat-hook/src/test/resources>
[INFO] [compiler:testCompile {execution: default-testCompile}]
[INFO] No sources to compile
[INFO] [surefire:test {execution: default-test}]
[INFO] No tests to run.
[HUDSON] Recording test results
[INFO] [jar:jar {execution: default-jar}]
[INFO] Building jar: <http://hudson.zones.apache.org/hudson/job/Tuscany-2x/ws/sca-2x/distribution/tomcat/tomcat-hook/target/tuscany-tomcat-hook-2.0-SNAPSHOT.jar>
[INFO] [install:install {execution: default-install}]
[INFO] Installing <http://hudson.zones.apache.org/hudson/job/Tuscany-2x/ws/sca-2x/distribution/tomcat/tomcat-hook/target/tuscany-tomcat-hook-2.0-SNAPSHOT.jar>
to /home/hudson/.m2/repository/org/apache/tuscany/sca/tuscany-tomcat-hook/2.0-SNAPSHOT/tuscany-tomcat-hook-2.0-SNAPSHOT.jar
[HUDSON] Archiving <http://hudson.zones.apache.org/hudson/job/Tuscany-2x/ws/sca-2x/distribution/tomcat/tomcat-hook/pom.xml>
to /export/home/hudson/hudson/jobs/Tuscany-2x/modules/org.apache.tuscany.sca$tuscany-tomcat-hook/builds/2010-01-05_18-38-56/archive/org.apache.tuscany.sca/tuscany-tomcat-hook/2.0-SNAPSHOT/pom.xml
[HUDSON] Archiving <http://hudson.zones.apache.org/hudson/job/Tuscany-2x/ws/sca-2x/distribution/tomcat/tomcat-hook/target/tuscany-tomcat-hook-2.0-SNAPSHOT.jar>
to /export/home/hudson/hudson/jobs/Tuscany-2x/modules/org.apache.tuscany.sca$tuscany-tomcat-hook/builds/2010-01-05_18-38-56/archive/org.apache.tuscany.sca/tuscany-tomcat-hook/2.0-SNAPSHOT/tuscany-tomcat-hook-2.0-SNAPSHOT.jar
[INFO] ------------------------------------------------------------------------
[INFO] Building Apache Tuscany SCA Tomcat Integration Servlet
[INFO]    task-segment: [clean, install]
[INFO] ------------------------------------------------------------------------
[INFO] [clean:clean {execution: default-clean}]
[INFO] Deleting file set: <http://hudson.zones.apache.org/hudson/job/Tuscany-2x/ws/sca-2x/distribution/tomcat/tomcat-servlet/target>
(included: [**], excluded: [])
[INFO] [enforcer:enforce {execution: enforce-plugin-versions}]
[INFO] [resources:resources {execution: default-resources}]
[WARNING] Using platform encoding (UTF-8 actually) to copy filtered resources, i.e. build
is platform dependent!
[INFO] skip non existing resourceDirectory <http://hudson.zones.apache.org/hudson/job/Tuscany-2x/ws/sca-2x/distribution/tomcat/tomcat-servlet/src/main/resources>
[INFO] Copying 1 resource
[INFO] [compiler:compile {execution: default-compile}]
[INFO] Invoking Tuscany Eclipse JDT compiler
[INFO] Compiling 2 to <http://hudson.zones.apache.org/hudson/job/Tuscany-2x/ws/sca-2x/distribution/tomcat/tomcat-servlet/target/classes>
[INFO] Resolving OSGi bundle: org.apache.tuscany.sca.tomcat.servlet
[ERROR] --> [org.apache.tuscany.sca.tomcat.servlet] Missing Constraint: Import-Package:
org.apache.tuscany.sca.tomcat; version="2.0.0"
[ERROR] --> [org.apache.tuscany.sca.tomcat] Bundle unresolved: Export-Package: org.apache.tuscany.sca.tomcat;
version="2.0.0"
[ERROR] ----> [org.apache.tuscany.sca.tomcat] Missing Constraint: Import-Package: org.apache.tuscany.sca.core;
version="2.0.0"
[INFO] [resources:testResources {execution: default-testResources}]
[WARNING] Using platform encoding (UTF-8 actually) to copy filtered resources, i.e. build
is platform dependent!
[INFO] skip non existing resourceDirectory <http://hudson.zones.apache.org/hudson/job/Tuscany-2x/ws/sca-2x/distribution/tomcat/tomcat-servlet/src/test/resources>
[INFO] [compiler:testCompile {execution: default-testCompile}]
[INFO] No sources to compile
[INFO] [surefire:test {execution: default-test}]
[INFO] No tests to run.
[HUDSON] Recording test results
[INFO] [jar:jar {execution: default-jar}]
[INFO] Building jar: <http://hudson.zones.apache.org/hudson/job/Tuscany-2x/ws/sca-2x/distribution/tomcat/tomcat-servlet/target/tuscany-tomcat-servlet-2.0-SNAPSHOT.jar>
[INFO] [install:install {execution: default-install}]
[INFO] Installing <http://hudson.zones.apache.org/hudson/job/Tuscany-2x/ws/sca-2x/distribution/tomcat/tomcat-servlet/target/tuscany-tomcat-servlet-2.0-SNAPSHOT.jar>
to /home/hudson/.m2/repository/org/apache/tuscany/sca/tuscany-tomcat-servlet/2.0-SNAPSHOT/tuscany-tomcat-servlet-2.0-SNAPSHOT.jar
[HUDSON] Archiving <http://hudson.zones.apache.org/hudson/job/Tuscany-2x/ws/sca-2x/distribution/tomcat/tomcat-servlet/pom.xml>
to /export/home/hudson/hudson/jobs/Tuscany-2x/modules/org.apache.tuscany.sca$tuscany-tomcat-servlet/builds/2010-01-05_18-38-56/archive/org.apache.tuscany.sca/tuscany-tomcat-servlet/2.0-SNAPSHOT/pom.xml
[HUDSON] Archiving <http://hudson.zones.apache.org/hudson/job/Tuscany-2x/ws/sca-2x/distribution/tomcat/tomcat-servlet/target/tuscany-tomcat-servlet-2.0-SNAPSHOT.jar>
to /export/home/hudson/hudson/jobs/Tuscany-2x/modules/org.apache.tuscany.sca$tuscany-tomcat-servlet/builds/2010-01-05_18-38-56/archive/org.apache.tuscany.sca/tuscany-tomcat-servlet/2.0-SNAPSHOT/tuscany-tomcat-servlet-2.0-SNAPSHOT.jar
[INFO] ------------------------------------------------------------------------
[INFO] Building Apache Tuscany SCA Tomcat Deep Integration WAR
[INFO]    task-segment: [clean, install]
[INFO] ------------------------------------------------------------------------
[INFO] [clean:clean {execution: default-clean}]
[INFO] Deleting file set: <http://hudson.zones.apache.org/hudson/job/Tuscany-2x/ws/sca-2x/distribution/tomcat/tomcat-war/target>
(included: [**], excluded: [])
[INFO] [enforcer:enforce {execution: enforce-plugin-versions}]
[INFO] snapshot org.apache.tuscany.sca:tuscany-distribution:2.0-SNAPSHOT: checking for updates
from apache.snapshots
[INFO] [site:attach-descriptor {execution: default-attach-descriptor}]
[INFO] [assembly:attached {execution: war}]
[INFO] Reading assembly descriptor: src/main/assembly/war.xml
[INFO] Processing DependencySet (output=tuscany-lib)
[WARNING] Cannot include project artifact: org.apache.tuscany.sca:tuscany-war:pom:2.0-SNAPSHOT;
it doesn't have an associated file or directory.
[WARNING] The following patterns were never triggered in this artifact exclusion filter:
o  'org.apache.tomcat:catalina'
o  'org.apache.tomcat:annotations-api'
o  'org.apache.tomcat:servlet-api'

[HUDSON] Archiving <http://hudson.zones.apache.org/hudson/job/Tuscany-2x/ws/sca-2x/distribution/tomcat/tomcat-war/pom.xml>
to /export/home/hudson/hudson/jobs/Tuscany-2x/modules/org.apache.tuscany.sca$tuscany-war/builds/2010-01-05_18-38-56/archive/org.apache.tuscany.sca/tuscany-war/2.0-SNAPSHOT/pom.xml
[INFO] ------------------------------------------------------------------------
[ERROR] BUILD ERROR
[INFO] ------------------------------------------------------------------------
[INFO] Failed to create assembly: Failed to retrieve OS environment variables. Reason: Cannot
run program "env": java.io.IOException: error=24, Too many open files

[INFO] ------------------------------------------------------------------------
[INFO] For more information, run Maven with the -e switch
[INFO] ------------------------------------------------------------------------
[INFO] Total time: 42 minutes 23 seconds
[INFO] Finished at: Tue Jan 05 19:22:37 UTC 2010
[INFO] Final Memory: 122M/751M
[INFO] ------------------------------------------------------------------------
Waiting for Hudson to finish collecting data
Sending e-mails to: commits@tuscany.apache.org
channel stopped
2010-01-05 19:22:40.115::INFO:  Shutdown hook executing
2010-01-05 19:22:40.115::INFO:  Shutdown hook executing
2010-01-05 19:22:40.115::INFO:  Shutdown hook executing
2010-01-05 19:22:40.115::INFO:  Shutdown hook complete
2010-01-05 19:22:40.116::INFO:  Shutdown hook complete
2010-01-05 19:22:40.115::INFO:  Shutdown hook executing
2010-01-05 19:22:40.115::INFO:  Shutdown hook executing
2010-01-05 19:22:40.117::INFO:  Shutdown hook complete
2010-01-05 19:22:40.115::INFO:  Shutdown hook complete
2010-01-05 19:22:40.117::INFO:  Shutdown hook complete
2010-01-05 19:22:40.116::INFO:  Shutdown hook executing
2010-01-05 19:22:40.117::INFO:  Shutdown hook complete
     [java] Jan 5, 2010 7:22:40 PM org.apache.tuscany.sca.node.impl.NodeImpl stop
     [java] INFO: Stopping node: http://sample/nodes/TestNode1
     [java] Java Result: 143


Mime
View raw message