tuscany-commits mailing list archives

Site index · List index
Message view « Date » · « Thread »
Top « Date » · « Thread »
From Apache Hudson Server <hud...@hudson.zones.apache.org>
Subject Build failed in Hudson: Tuscany-2.x-M5-Brn #14
Date Fri, 04 Jun 2010 22:29:12 GMT
See <http://hudson.zones.apache.org/hudson/job/Tuscany-2.x-M5-Brn/14/changes>

Changes:

[lresende] TUSCANY-3565 - Adding missing dojo extension provider

------------------------------------------
[...truncated 7800 lines...]
[HUDSON] Recording test results
[INFO] [jar:jar {execution: default-jar}]
[INFO] Building jar: <http://hudson.zones.apache.org/hudson/job/Tuscany-2.x-M5-Brn/ws/sca-2x/modules/implementation-bpel-runtime/target/tuscany-implementation-bpel-runtime-2.0-M5-SNAPSHOT.jar>
[INFO] [install:install {execution: default-install}]
[INFO] Installing <http://hudson.zones.apache.org/hudson/job/Tuscany-2.x-M5-Brn/ws/sca-2x/modules/implementation-bpel-runtime/target/tuscany-implementation-bpel-runtime-2.0-M5-SNAPSHOT.jar>
to /home/hudson/.m2/repository/org/apache/tuscany/sca/tuscany-implementation-bpel-runtime/2.0-M5-SNAPSHOT/tuscany-implementation-bpel-runtime-2.0-M5-SNAPSHOT.jar
[HUDSON] Archiving <http://hudson.zones.apache.org/hudson/job/Tuscany-2.x-M5-Brn/ws/sca-2x/modules/implementation-bpel-runtime/pom.xml>
to /export/home/hudson/hudson/jobs/Tuscany-2.x-M5-Brn/modules/org.apache.tuscany.sca$tuscany-implementation-bpel-runtime/builds/2010-06-04_22-09-29/archive/org.apache.tuscany.sca/tuscany-implementation-bpel-runtime/2.0-M5-SNAPSHOT/pom.xml
[HUDSON] Archiving <http://hudson.zones.apache.org/hudson/job/Tuscany-2.x-M5-Brn/ws/sca-2x/modules/implementation-bpel-runtime/target/tuscany-implementation-bpel-runtime-2.0-M5-SNAPSHOT.jar>
to /export/home/hudson/hudson/jobs/Tuscany-2.x-M5-Brn/modules/org.apache.tuscany.sca$tuscany-implementation-bpel-runtime/builds/2010-06-04_22-09-29/archive/org.apache.tuscany.sca/tuscany-implementation-bpel-runtime/2.0-M5-SNAPSHOT/tuscany-implementation-bpel-runtime-2.0-M5-SNAPSHOT.jar
[INFO] ------------------------------------------------------------------------
[INFO] Building Apache Tuscany SCA Spring Implementation Model
[INFO]    task-segment: [clean, install]
[INFO] ------------------------------------------------------------------------
[INFO] [clean:clean {execution: default-clean}]
[INFO] Deleting <http://hudson.zones.apache.org/hudson/job/Tuscany-2.x-M5-Brn/ws/sca-2x/modules/implementation-spring/target>
[INFO] [enforcer:enforce {execution: enforce-plugin-versions}]
[INFO] [resources:resources {execution: default-resources}]
[INFO] Using 'UTF-8' encoding to copy filtered resources.
[INFO] Copying 6 resources
[INFO] Copying 4 resources
[INFO] [compiler:compile {execution: default-compile}]
[INFO] Compiling 21 source files to <http://hudson.zones.apache.org/hudson/job/Tuscany-2.x-M5-Brn/ws/sca-2x/modules/implementation-spring/target/classes>
[INFO] [resources:testResources {execution: default-testResources}]
[INFO] Using 'UTF-8' encoding to copy filtered resources.
[INFO] skip non existing resourceDirectory <http://hudson.zones.apache.org/hudson/job/Tuscany-2.x-M5-Brn/ws/sca-2x/modules/implementation-spring/src/test/resources>
[INFO] [compiler:testCompile {execution: default-testCompile}]
[INFO] No sources to compile
[INFO] [surefire:test {execution: default-test}]
[INFO] No tests to run.
[HUDSON] Recording test results
[INFO] [jar:jar {execution: default-jar}]
[INFO] Building jar: <http://hudson.zones.apache.org/hudson/job/Tuscany-2.x-M5-Brn/ws/sca-2x/modules/implementation-spring/target/tuscany-implementation-spring-2.0-M5-SNAPSHOT.jar>
[INFO] [install:install {execution: default-install}]
[INFO] Installing <http://hudson.zones.apache.org/hudson/job/Tuscany-2.x-M5-Brn/ws/sca-2x/modules/implementation-spring/target/tuscany-implementation-spring-2.0-M5-SNAPSHOT.jar>
to /home/hudson/.m2/repository/org/apache/tuscany/sca/tuscany-implementation-spring/2.0-M5-SNAPSHOT/tuscany-implementation-spring-2.0-M5-SNAPSHOT.jar
[HUDSON] Archiving <http://hudson.zones.apache.org/hudson/job/Tuscany-2.x-M5-Brn/ws/sca-2x/modules/implementation-spring/pom.xml>
to /export/home/hudson/hudson/jobs/Tuscany-2.x-M5-Brn/modules/org.apache.tuscany.sca$tuscany-implementation-spring/builds/2010-06-04_22-09-29/archive/org.apache.tuscany.sca/tuscany-implementation-spring/2.0-M5-SNAPSHOT/pom.xml
[HUDSON] Archiving <http://hudson.zones.apache.org/hudson/job/Tuscany-2.x-M5-Brn/ws/sca-2x/modules/implementation-spring/target/tuscany-implementation-spring-2.0-M5-SNAPSHOT.jar>
to /export/home/hudson/hudson/jobs/Tuscany-2.x-M5-Brn/modules/org.apache.tuscany.sca$tuscany-implementation-spring/builds/2010-06-04_22-09-29/archive/org.apache.tuscany.sca/tuscany-implementation-spring/2.0-M5-SNAPSHOT/tuscany-implementation-spring-2.0-M5-SNAPSHOT.jar
[INFO] ------------------------------------------------------------------------
[INFO] Building Apache Tuscany SCA Spring Implementation Runtime Model
[INFO]    task-segment: [clean, install]
[INFO] ------------------------------------------------------------------------
[INFO] [clean:clean {execution: default-clean}]
[INFO] Deleting <http://hudson.zones.apache.org/hudson/job/Tuscany-2.x-M5-Brn/ws/sca-2x/modules/implementation-spring-sca/target>
[INFO] [enforcer:enforce {execution: enforce-plugin-versions}]
[INFO] [resources:resources {execution: default-resources}]
[INFO] Using 'UTF-8' encoding to copy filtered resources.
[INFO] Copying 3 resources
[INFO] Copying 4 resources
[INFO] [compiler:compile {execution: default-compile}]
[INFO] Compiling 16 source files to <http://hudson.zones.apache.org/hudson/job/Tuscany-2.x-M5-Brn/ws/sca-2x/modules/implementation-spring-sca/target/classes>
[INFO] [resources:testResources {execution: default-testResources}]
[INFO] Using 'UTF-8' encoding to copy filtered resources.
[INFO] skip non existing resourceDirectory <http://hudson.zones.apache.org/hudson/job/Tuscany-2.x-M5-Brn/ws/sca-2x/modules/implementation-spring-sca/src/test/resources>
[INFO] [compiler:testCompile {execution: default-testCompile}]
[INFO] No sources to compile
[INFO] [surefire:test {execution: default-test}]
[INFO] No tests to run.
[HUDSON] Recording test results
[INFO] [jar:jar {execution: default-jar}]
[INFO] Building jar: <http://hudson.zones.apache.org/hudson/job/Tuscany-2.x-M5-Brn/ws/sca-2x/modules/implementation-spring-sca/target/tuscany-implementation-spring-sca-2.0-M5-SNAPSHOT.jar>
[INFO] [install:install {execution: default-install}]
[INFO] Installing <http://hudson.zones.apache.org/hudson/job/Tuscany-2.x-M5-Brn/ws/sca-2x/modules/implementation-spring-sca/target/tuscany-implementation-spring-sca-2.0-M5-SNAPSHOT.jar>
to /home/hudson/.m2/repository/org/apache/tuscany/sca/tuscany-implementation-spring-sca/2.0-M5-SNAPSHOT/tuscany-implementation-spring-sca-2.0-M5-SNAPSHOT.jar
[HUDSON] Archiving <http://hudson.zones.apache.org/hudson/job/Tuscany-2.x-M5-Brn/ws/sca-2x/modules/implementation-spring-sca/pom.xml>
to /export/home/hudson/hudson/jobs/Tuscany-2.x-M5-Brn/modules/org.apache.tuscany.sca$tuscany-implementation-spring-sca/builds/2010-06-04_22-09-29/archive/org.apache.tuscany.sca/tuscany-implementation-spring-sca/2.0-M5-SNAPSHOT/pom.xml
[HUDSON] Archiving <http://hudson.zones.apache.org/hudson/job/Tuscany-2.x-M5-Brn/ws/sca-2x/modules/implementation-spring-sca/target/tuscany-implementation-spring-sca-2.0-M5-SNAPSHOT.jar>
to /export/home/hudson/hudson/jobs/Tuscany-2.x-M5-Brn/modules/org.apache.tuscany.sca$tuscany-implementation-spring-sca/builds/2010-06-04_22-09-29/archive/org.apache.tuscany.sca/tuscany-implementation-spring-sca/2.0-M5-SNAPSHOT/tuscany-implementation-spring-sca-2.0-M5-SNAPSHOT.jar
[INFO] ------------------------------------------------------------------------
[INFO] Building Apache Tuscany SCA Web Implementation Client
[INFO]    task-segment: [clean, install]
[INFO] ------------------------------------------------------------------------
[INFO] [clean:clean {execution: default-clean}]
[INFO] Deleting <http://hudson.zones.apache.org/hudson/job/Tuscany-2.x-M5-Brn/ws/sca-2x/modules/implementation-web-client/target>
[INFO] [enforcer:enforce {execution: enforce-plugin-versions}]
[INFO] [resources:resources {execution: default-resources}]
[INFO] Using 'UTF-8' encoding to copy filtered resources.
[INFO] Copying 1 resource
[INFO] Copying 3 resources
[INFO] [compiler:compile {execution: default-compile}]
[INFO] Compiling 2 source files to <http://hudson.zones.apache.org/hudson/job/Tuscany-2.x-M5-Brn/ws/sca-2x/modules/implementation-web-client/target/classes>
[INFO] [resources:testResources {execution: default-testResources}]
[INFO] Using 'UTF-8' encoding to copy filtered resources.
[INFO] Copying 0 resource
[INFO] [compiler:testCompile {execution: default-testCompile}]
[INFO] Nothing to compile - all classes are up to date
[INFO] [surefire:test {execution: default-test}]
[INFO] Surefire report directory: <http://hudson.zones.apache.org/hudson/job/Tuscany-2.x-M5-Brn/ws/sca-2x/modules/implementation-web-client/target/surefire-reports>

-------------------------------------------------------
 T E S T S
-------------------------------------------------------
There are no tests to run.

Results :

Tests run: 0, Failures: 0, Errors: 0, Skipped: 0

[HUDSON] Recording test results
[INFO] [jar:jar {execution: default-jar}]
[INFO] Building jar: <http://hudson.zones.apache.org/hudson/job/Tuscany-2.x-M5-Brn/ws/sca-2x/modules/implementation-web-client/target/tuscany-implementation-web-client-2.0-M5-SNAPSHOT.jar>
[INFO] [install:install {execution: default-install}]
[INFO] Installing <http://hudson.zones.apache.org/hudson/job/Tuscany-2.x-M5-Brn/ws/sca-2x/modules/implementation-web-client/target/tuscany-implementation-web-client-2.0-M5-SNAPSHOT.jar>
to /home/hudson/.m2/repository/org/apache/tuscany/sca/tuscany-implementation-web-client/2.0-M5-SNAPSHOT/tuscany-implementation-web-client-2.0-M5-SNAPSHOT.jar
[HUDSON] Archiving <http://hudson.zones.apache.org/hudson/job/Tuscany-2.x-M5-Brn/ws/sca-2x/modules/implementation-web-client/pom.xml>
to /export/home/hudson/hudson/jobs/Tuscany-2.x-M5-Brn/modules/org.apache.tuscany.sca$tuscany-implementation-web-client/builds/2010-06-04_22-09-30/archive/org.apache.tuscany.sca/tuscany-implementation-web-client/2.0-M5-SNAPSHOT/pom.xml
[HUDSON] Archiving <http://hudson.zones.apache.org/hudson/job/Tuscany-2.x-M5-Brn/ws/sca-2x/modules/implementation-web-client/target/tuscany-implementation-web-client-2.0-M5-SNAPSHOT.jar>
to /export/home/hudson/hudson/jobs/Tuscany-2.x-M5-Brn/modules/org.apache.tuscany.sca$tuscany-implementation-web-client/builds/2010-06-04_22-09-30/archive/org.apache.tuscany.sca/tuscany-implementation-web-client/2.0-M5-SNAPSHOT/tuscany-implementation-web-client-2.0-M5-SNAPSHOT.jar
[INFO] ------------------------------------------------------------------------
[INFO] Building Apache Tuscany SCA Widget Implementation Model
[INFO]    task-segment: [clean, install]
[INFO] ------------------------------------------------------------------------
[INFO] [clean:clean {execution: default-clean}]
[INFO] Deleting <http://hudson.zones.apache.org/hudson/job/Tuscany-2.x-M5-Brn/ws/sca-2x/modules/implementation-widget/target>
[INFO] [enforcer:enforce {execution: enforce-plugin-versions}]
[INFO] [resources:resources {execution: default-resources}]
[INFO] Using 'UTF-8' encoding to copy filtered resources.
[INFO] Copying 3 resources
[INFO] Copying 3 resources
[INFO] [compiler:compile {execution: default-compile}]
[INFO] Compiling 8 source files to <http://hudson.zones.apache.org/hudson/job/Tuscany-2.x-M5-Brn/ws/sca-2x/modules/implementation-widget/target/classes>
[INFO] [resources:testResources {execution: default-testResources}]
[INFO] Using 'UTF-8' encoding to copy filtered resources.
[INFO] Copying 0 resource
[INFO] [compiler:testCompile {execution: default-testCompile}]
[INFO] Nothing to compile - all classes are up to date
[INFO] [surefire:test {execution: default-test}]
[INFO] Surefire report directory: <http://hudson.zones.apache.org/hudson/job/Tuscany-2.x-M5-Brn/ws/sca-2x/modules/implementation-widget/target/surefire-reports>

-------------------------------------------------------
 T E S T S
-------------------------------------------------------
There are no tests to run.

Results :

Tests run: 0, Failures: 0, Errors: 0, Skipped: 0

[HUDSON] Recording test results
[INFO] [jar:jar {execution: default-jar}]
[INFO] Building jar: <http://hudson.zones.apache.org/hudson/job/Tuscany-2.x-M5-Brn/ws/sca-2x/modules/implementation-widget/target/tuscany-implementation-widget-2.0-M5-SNAPSHOT.jar>
[INFO] [install:install {execution: default-install}]
[INFO] Installing <http://hudson.zones.apache.org/hudson/job/Tuscany-2.x-M5-Brn/ws/sca-2x/modules/implementation-widget/target/tuscany-implementation-widget-2.0-M5-SNAPSHOT.jar>
to /home/hudson/.m2/repository/org/apache/tuscany/sca/tuscany-implementation-widget/2.0-M5-SNAPSHOT/tuscany-implementation-widget-2.0-M5-SNAPSHOT.jar
[HUDSON] Archiving <http://hudson.zones.apache.org/hudson/job/Tuscany-2.x-M5-Brn/ws/sca-2x/modules/implementation-widget/pom.xml>
to /export/home/hudson/hudson/jobs/Tuscany-2.x-M5-Brn/modules/org.apache.tuscany.sca$tuscany-implementation-widget/builds/2010-06-04_22-09-30/archive/org.apache.tuscany.sca/tuscany-implementation-widget/2.0-M5-SNAPSHOT/pom.xml
[HUDSON] Archiving <http://hudson.zones.apache.org/hudson/job/Tuscany-2.x-M5-Brn/ws/sca-2x/modules/implementation-widget/target/tuscany-implementation-widget-2.0-M5-SNAPSHOT.jar>
to /export/home/hudson/hudson/jobs/Tuscany-2.x-M5-Brn/modules/org.apache.tuscany.sca$tuscany-implementation-widget/builds/2010-06-04_22-09-30/archive/org.apache.tuscany.sca/tuscany-implementation-widget/2.0-M5-SNAPSHOT/tuscany-implementation-widget-2.0-M5-SNAPSHOT.jar
[INFO] ------------------------------------------------------------------------
[INFO] Building Apache Tuscany SCA Widget Implementation Runtime
[INFO]    task-segment: [clean, install]
[INFO] ------------------------------------------------------------------------
[INFO] [clean:clean {execution: default-clean}]
[INFO] Deleting <http://hudson.zones.apache.org/hudson/job/Tuscany-2.x-M5-Brn/ws/sca-2x/modules/implementation-widget-runtime/target>
[INFO] [enforcer:enforce {execution: enforce-plugin-versions}]
[INFO] [resources:resources {execution: default-resources}]
[INFO] Using 'UTF-8' encoding to copy filtered resources.
[INFO] Copying 3 resources
[INFO] Copying 3 resources
[INFO] [compiler:compile {execution: default-compile}]
[INFO] Compiling 4 source files to <http://hudson.zones.apache.org/hudson/job/Tuscany-2.x-M5-Brn/ws/sca-2x/modules/implementation-widget-runtime/target/classes>
[INFO] [resources:testResources {execution: default-testResources}]
[INFO] Using 'UTF-8' encoding to copy filtered resources.
[INFO] Copying 0 resource
[INFO] [compiler:testCompile {execution: default-testCompile}]
[INFO] Nothing to compile - all classes are up to date
[INFO] [surefire:test {execution: default-test}]
[INFO] Surefire report directory: <http://hudson.zones.apache.org/hudson/job/Tuscany-2.x-M5-Brn/ws/sca-2x/modules/implementation-widget-runtime/target/surefire-reports>

-------------------------------------------------------
 T E S T S
-------------------------------------------------------
There are no tests to run.

Results :

Tests run: 0, Failures: 0, Errors: 0, Skipped: 0

[HUDSON] Recording test results
[INFO] [jar:jar {execution: default-jar}]
[INFO] Building jar: <http://hudson.zones.apache.org/hudson/job/Tuscany-2.x-M5-Brn/ws/sca-2x/modules/implementation-widget-runtime/target/tuscany-implementation-widget-runtime-2.0-M5-SNAPSHOT.jar>
[INFO] [install:install {execution: default-install}]
[INFO] Installing <http://hudson.zones.apache.org/hudson/job/Tuscany-2.x-M5-Brn/ws/sca-2x/modules/implementation-widget-runtime/target/tuscany-implementation-widget-runtime-2.0-M5-SNAPSHOT.jar>
to /home/hudson/.m2/repository/org/apache/tuscany/sca/tuscany-implementation-widget-runtime/2.0-M5-SNAPSHOT/tuscany-implementation-widget-runtime-2.0-M5-SNAPSHOT.jar
[HUDSON] Archiving <http://hudson.zones.apache.org/hudson/job/Tuscany-2.x-M5-Brn/ws/sca-2x/modules/implementation-widget-runtime/pom.xml>
to /export/home/hudson/hudson/jobs/Tuscany-2.x-M5-Brn/modules/org.apache.tuscany.sca$tuscany-implementation-widget-runtime/builds/2010-06-04_22-09-30/archive/org.apache.tuscany.sca/tuscany-implementation-widget-runtime/2.0-M5-SNAPSHOT/pom.xml
[HUDSON] Archiving <http://hudson.zones.apache.org/hudson/job/Tuscany-2.x-M5-Brn/ws/sca-2x/modules/implementation-widget-runtime/target/tuscany-implementation-widget-runtime-2.0-M5-SNAPSHOT.jar>
to /export/home/hudson/hudson/jobs/Tuscany-2.x-M5-Brn/modules/org.apache.tuscany.sca$tuscany-implementation-widget-runtime/builds/2010-06-04_22-09-30/archive/org.apache.tuscany.sca/tuscany-implementation-widget-runtime/2.0-M5-SNAPSHOT/tuscany-implementation-widget-runtime-2.0-M5-SNAPSHOT.jar
[INFO] ------------------------------------------------------------------------
[INFO] Building Apache Tuscany SCA Web JavaScript for DOJO
[INFO]    task-segment: [clean, install]
[INFO] ------------------------------------------------------------------------
[INFO] [clean:clean {execution: default-clean}]
[INFO] Deleting <http://hudson.zones.apache.org/hudson/job/Tuscany-2.x-M5-Brn/ws/sca-2x/modules/web-javascript-dojo/target>
[INFO] snapshot org.apache.tuscany.sca:tuscany-implementation-widget:2.0-SNAPSHOT: checking
for updates from apache.snapshots
[INFO] snapshot org.apache.tuscany.sca:tuscany-modules:2.0-SNAPSHOT: checking for updates
from apache.snapshots
[INFO] snapshot org.apache.tuscany.sca:tuscany-sca:2.0-SNAPSHOT: checking for updates from
apache.snapshots
[INFO] snapshot org.apache.tuscany.sca:tuscany-assembly-xml:2.0-SNAPSHOT: checking for updates
from apache.snapshots
[INFO] snapshot org.apache.tuscany.sca:tuscany-assembly:2.0-SNAPSHOT: checking for updates
from apache.snapshots
[INFO] snapshot org.apache.tuscany.sca:tuscany-contribution:2.0-SNAPSHOT: checking for updates
from apache.snapshots
[INFO] snapshot org.apache.tuscany.sca:tuscany-xsd:2.0-SNAPSHOT: checking for updates from
apache.snapshots
[INFO] snapshot org.apache.tuscany.sca:tuscany-assembly-xsd:2.0-SNAPSHOT: checking for updates
from apache.snapshots
[INFO] snapshot org.apache.tuscany.sca:tuscany-interface-java:2.0-SNAPSHOT: checking for updates
from apache.snapshots
[INFO] snapshot org.apache.tuscany.sca:tuscany-data-api:2.0-SNAPSHOT: checking for updates
from apache.snapshots
[INFO] snapshot org.apache.tuscany.sca:tuscany-sca-api:2.0-SNAPSHOT: checking for updates
from apache.snapshots
[INFO] [antrun:run {execution: clean-dojo-files}]
[INFO] Executing tasks

clean-dojo-files:
   [delete] Deleting directory <http://hudson.zones.apache.org/hudson/job/Tuscany-2.x-M5-Brn/ws/sca-2x/modules/web-javascript-dojo/src/main/resources/dojo>
[INFO] Executed tasks
[INFO] [enforcer:enforce {execution: enforce-plugin-versions}]
[INFO] [antrun:run {execution: copy-dojo-files}]
[INFO] Executing tasks

check-dojo-installed:

check-dojo-unpacked:

unpack-dojo-files:
    [mkdir] Created dir: <http://hudson.zones.apache.org/hudson/job/Tuscany-2.x-M5-Brn/ws/sca-2x/modules/web-javascript-dojo/target/dojo-unpack-temp>
    [unzip] Expanding: /home/hudson/.m2/repository/org/dojotoolkit/dojo/1.3.0/dojo-1.3.0.zip
into <http://hudson.zones.apache.org/hudson/job/Tuscany-2.x-M5-Brn/ws/sca-2x/modules/web-javascript-dojo/target/dojo-unpack-temp>
     [move] Attempting to rename dir: <http://hudson.zones.apache.org/hudson/job/Tuscany-2.x-M5-Brn/ws/sca-2x/modules/web-javascript-dojo/target/dojo-unpack-temp/dojo-1.3.0>
to <http://hudson.zones.apache.org/hudson/job/Tuscany-2.x-M5-Brn/ws/sca-2x/modules/web-javascript-dojo/src/main/resources/dojo>
   [delete] Deleting directory <http://hudson.zones.apache.org/hudson/job/Tuscany-2.x-M5-Brn/ws/sca-2x/modules/web-javascript-dojo/target/dojo-unpack-temp>
[INFO] Executed tasks
[INFO] [resources:resources {execution: default-resources}]
[INFO] Using 'UTF-8' encoding to copy filtered resources.
[INFO] Copying 247 resources
[INFO] Copying 3 resources
[INFO] [compiler:compile {execution: default-compile}]
[INFO] Compiling 2 source files to <http://hudson.zones.apache.org/hudson/job/Tuscany-2.x-M5-Brn/ws/sca-2x/modules/web-javascript-dojo/target/classes>
[INFO] -------------------------------------------------------------
[ERROR] COMPILATION ERROR : 
[INFO] -------------------------------------------------------------
[ERROR] <http://hudson.zones.apache.org/hudson/job/Tuscany-2.x-M5-Brn/ws/sca-2x/modules/web-javascript-dojo/src/main/java/org/apache/tuscany/sca/web/javascript/dojo/DojoWidgetJavascriptProvider.java>:[31,62]
package org.apache.tuscany.sca.implementation.widget.javascript does not exist

[ERROR] <http://hudson.zones.apache.org/hudson/job/Tuscany-2.x-M5-Brn/ws/sca-2x/modules/web-javascript-dojo/src/main/java/org/apache/tuscany/sca/web/javascript/dojo/DojoWidgetJavascriptProvider.java>:[33,53]
cannot find symbol
symbol: class WidgetImplementationJavascriptProvider
public class DojoWidgetJavascriptProvider implements WidgetImplementationJavascriptProvider
{

[INFO] 2 errors 
[INFO] -------------------------------------------------------------
[HUDSON] Archiving <http://hudson.zones.apache.org/hudson/job/Tuscany-2.x-M5-Brn/ws/sca-2x/modules/web-javascript-dojo/pom.xml>
to /export/home/hudson/hudson/jobs/Tuscany-2.x-M5-Brn/modules/org.apache.tuscany.sca$tuscany-web-javascript-dojo/builds/2010-06-04_22-09-35/archive/org.apache.tuscany.sca/tuscany-web-javascript-dojo/2.0-M5-SNAPSHOT/pom.xml
[INFO] ------------------------------------------------------------------------
[ERROR] BUILD FAILURE
[INFO] ------------------------------------------------------------------------
[INFO] Compilation failure

<http://hudson.zones.apache.org/hudson/job/Tuscany-2.x-M5-Brn/ws/sca-2x/modules/web-javascript-dojo/src/main/java/org/apache/tuscany/sca/web/javascript/dojo/DojoWidgetJavascriptProvider.java>:[31,62]
package org.apache.tuscany.sca.implementation.widget.javascript does not exist

<http://hudson.zones.apache.org/hudson/job/Tuscany-2.x-M5-Brn/ws/sca-2x/modules/web-javascript-dojo/src/main/java/org/apache/tuscany/sca/web/javascript/dojo/DojoWidgetJavascriptProvider.java>:[33,53]
cannot find symbol
symbol: class WidgetImplementationJavascriptProvider
public class DojoWidgetJavascriptProvider implements WidgetImplementationJavascriptProvider
{


[INFO] ------------------------------------------------------------------------
[INFO] For more information, run Maven with the -e switch
[INFO] ------------------------------------------------------------------------
[INFO] Total time: 11 minutes 51 seconds
[INFO] Finished at: Fri Jun 04 22:22:21 UTC 2010
[INFO] Final Memory: 94M/737M
[INFO] ------------------------------------------------------------------------
Waiting for Hudson to finish collecting data
Sending e-mails to: commits@tuscany.apache.org
channel stopped


Mime
View raw message