tuscany-commits mailing list archives

Site index · List index
Message view « Date » · « Thread »
Top « Date » · « Thread »
From Apache Hudson Server <hud...@hudson.zones.apache.org>
Subject Build failed in Hudson: Tuscany-2x #787
Date Mon, 26 Jul 2010 09:12:39 GMT
See <http://hudson.zones.apache.org/hudson/job/Tuscany-2x/787/changes>

Changes:

[antelder] TUSCANY-3632: take out failing itest

[antelder] TUSCANY-3631: take out failing itest

------------------------------------------
[...truncated 17023 lines...]
	artifact = org.apache.tuscany.sca:tuscany-binding-jsonrpc-js-dojo:jar:2.0-SNAPSHOT:compile;
	project: MavenProject: org.apache.tuscany.sca:tuscany-binding-jsonrpc-js-dojo:2.0-SNAPSHOT
@ <http://hudson.zones.apache.org/hudson/job/Tuscany-2x/ws/sca-2x/modules/binding-jsonrpc-js-dojo/pom.xml>
[INFO] Adding OSGi bundle artifact: org.apache.tuscany.sdo:tuscany-sdo-api-r2.1:jar:1.1.1:compile
[INFO] Adding OSGi bundle artifact: org.apache.neethi:neethi:jar:2.0.4:compile
[INFO] Adding JAR artifact: org.directwebremoting:dwr:jar:2.0.3:compile
[INFO] Writing generated manifest for: org.directwebremoting:dwr:jar:2.0.3:compile to <http://hudson.zones.apache.org/hudson/job/Tuscany-2x/ws/sca-2x/distribution/all/target/modules/dwr-2.0.3/META-INF/MANIFEST.MF>
[INFO] Adding OSGi bundle artifact: active project artifact:
	artifact = org.apache.tuscany.sca:tuscany-interface-java:jar:2.0-SNAPSHOT:compile;
	project: MavenProject: org.apache.tuscany.sca:tuscany-interface-java:2.0-SNAPSHOT @ <http://hudson.zones.apache.org/hudson/job/Tuscany-2x/ws/sca-2x/modules/interface-java/pom.xml>
[INFO] Adding JAR artifact: org.apache.tuscany.sdo:tuscany-sdo-impl:jar:1.1.1:compile
[INFO] Writing generated manifest for: org.apache.tuscany.sdo:tuscany-sdo-impl:jar:1.1.1:compile
to <http://hudson.zones.apache.org/hudson/job/Tuscany-2x/ws/sca-2x/distribution/all/target/modules/tuscany-sdo-impl-1.1.1/META-INF/MANIFEST.MF>
[INFO] Adding OSGi bundle artifact: org.springframework:spring-expression:jar:3.0.2.RELEASE:compile
[INFO] Adding OSGi bundle artifact: active project artifact:
	artifact = org.apache.tuscany.sca:tuscany-databinding-sdo:jar:2.0-SNAPSHOT:compile;
	project: MavenProject: org.apache.tuscany.sca:tuscany-databinding-sdo:2.0-SNAPSHOT @ <http://hudson.zones.apache.org/hudson/job/Tuscany-2x/ws/sca-2x/modules/databinding-sdo/pom.xml>
[INFO] Adding OSGi bundle artifact: active project artifact:
	artifact = org.apache.tuscany.sca:tuscany-shell:jar:2.0-SNAPSHOT:compile;
	project: MavenProject: org.apache.tuscany.sca:tuscany-shell:2.0-SNAPSHOT @ <http://hudson.zones.apache.org/hudson/job/Tuscany-2x/ws/sca-2x/modules/shell/pom.xml>
[INFO] Adding JAR artifact: javax.xml.ws:jaxws-api:jar:2.1:compile
Jul 26, 2010 9:00:36 AM org.apache.tuscany.maven.bundle.plugin.BundleUtil libraryManifest
WARNING: Duplicate or system package skipped: javax.xml.ws.soap;version=2.1.0
Jul 26, 2010 9:00:36 AM org.apache.tuscany.maven.bundle.plugin.BundleUtil libraryManifest
WARNING: Duplicate or system package skipped: javax.xml.ws;version=2.1.0
Jul 26, 2010 9:00:36 AM org.apache.tuscany.maven.bundle.plugin.BundleUtil libraryManifest
WARNING: Duplicate or system package skipped: javax.xml.ws.spi;version=2.1.0
Jul 26, 2010 9:00:36 AM org.apache.tuscany.maven.bundle.plugin.BundleUtil libraryManifest
WARNING: Duplicate or system package skipped: javax.xml.ws.http;version=2.1.0
Jul 26, 2010 9:00:36 AM org.apache.tuscany.maven.bundle.plugin.BundleUtil libraryManifest
WARNING: Duplicate or system package skipped: javax.xml.ws.handler;version=2.1.0
Jul 26, 2010 9:00:36 AM org.apache.tuscany.maven.bundle.plugin.BundleUtil libraryManifest
WARNING: Duplicate or system package skipped: javax.xml.ws.handler.soap;version=2.1.0
[INFO] Writing generated manifest for: javax.xml.ws:jaxws-api:jar:2.1:compile to <http://hudson.zones.apache.org/hudson/job/Tuscany-2x/ws/sca-2x/distribution/all/target/modules/jaxws-api-2.1/META-INF/MANIFEST.MF>
[INFO] Adding JAR artifact: org.apache.ode:ode-jacob-ap:jar:1.3.2:compile
[INFO] Writing generated manifest for: org.apache.ode:ode-jacob-ap:jar:1.3.2:compile to <http://hudson.zones.apache.org/hudson/job/Tuscany-2x/ws/sca-2x/distribution/all/target/modules/ode-jacob-ap-1.3.2/META-INF/MANIFEST.MF>
[INFO] Adding JAR artifact: org.apache.abdera:abdera-parser:jar:1.0:compile
[INFO] Writing generated manifest for: org.apache.abdera:abdera-parser:jar:1.0:compile to
<http://hudson.zones.apache.org/hudson/job/Tuscany-2x/ws/sca-2x/distribution/all/target/modules/abdera-parser-1.0/META-INF/MANIFEST.MF>
[INFO] Adding OSGi bundle artifact: active project artifact:
	artifact = org.apache.tuscany.sca:tuscany-binding-corba-runtime:jar:2.0-SNAPSHOT:compile;
	project: MavenProject: org.apache.tuscany.sca:tuscany-binding-corba-runtime:2.0-SNAPSHOT
@ <http://hudson.zones.apache.org/hudson/job/Tuscany-2x/ws/sca-2x/modules/binding-corba-runtime/pom.xml>
[INFO] Adding JAR artifact: commons-fileupload:commons-fileupload:jar:1.2:compile
[INFO] Writing generated manifest for: commons-fileupload:commons-fileupload:jar:1.2:compile
to <http://hudson.zones.apache.org/hudson/job/Tuscany-2x/ws/sca-2x/distribution/all/target/modules/commons-fileupload-1.2/META-INF/MANIFEST.MF>
[INFO] Adding OSGi bundle artifact: org.apache.geronimo.specs:geronimo-j2ee-connector_1.5_spec:jar:2.0.0:compile
[INFO] Adding OSGi bundle artifact: active project artifact:
	artifact = org.apache.tuscany.sca:tuscany-binding-ejb:jar:2.0-SNAPSHOT:compile;
	project: MavenProject: org.apache.tuscany.sca:tuscany-binding-ejb:2.0-SNAPSHOT @ <http://hudson.zones.apache.org/hudson/job/Tuscany-2x/ws/sca-2x/modules/binding-ejb/pom.xml>
[INFO] Adding OSGi bundle artifact: active project artifact:
	artifact = org.apache.tuscany.sca:tuscany-binding-jsonrpc-runtime:jar:2.0-SNAPSHOT:compile;
	project: MavenProject: org.apache.tuscany.sca:tuscany-binding-jsonrpc-runtime:2.0-SNAPSHOT
@ <http://hudson.zones.apache.org/hudson/job/Tuscany-2x/ws/sca-2x/modules/binding-jsonrpc-runtime/pom.xml>
[INFO] Adding OSGi bundle artifact: active project artifact:
	artifact = org.apache.tuscany.sca:tuscany-core-spi:jar:2.0-SNAPSHOT:compile;
	project: MavenProject: org.apache.tuscany.sca:tuscany-core-spi:2.0-SNAPSHOT @ <http://hudson.zones.apache.org/hudson/job/Tuscany-2x/ws/sca-2x/modules/core-spi/pom.xml>
[INFO] Adding JAR artifact: org.apache.ode:ode-bpel-epr:jar:1.3.2:compile
[INFO] Writing generated manifest for: org.apache.ode:ode-bpel-epr:jar:1.3.2:compile to <http://hudson.zones.apache.org/hudson/job/Tuscany-2x/ws/sca-2x/distribution/all/target/modules/ode-bpel-epr-1.3.2/META-INF/MANIFEST.MF>
[INFO] Adding JAR artifact: annogen:annogen:jar:0.1.0:compile
[INFO] Writing generated manifest for: annogen:annogen:jar:0.1.0:compile to <http://hudson.zones.apache.org/hudson/job/Tuscany-2x/ws/sca-2x/distribution/all/target/modules/annogen-0.1.0/META-INF/MANIFEST.MF>
[INFO] Adding JAR artifact: org.apache.rampart:rampart-trust:jar:1.4:compile
[INFO] Writing generated manifest for: org.apache.rampart:rampart-trust:jar:1.4:compile to
<http://hudson.zones.apache.org/hudson/job/Tuscany-2x/ws/sca-2x/distribution/all/target/modules/rampart-trust-1.4/META-INF/MANIFEST.MF>
[INFO] Adding OSGi bundle artifact: com.hazelcast:hazelcast:jar:1.8.3:compile
[INFO] Adding OSGi bundle artifact: org.apache.geronimo.components:geronimo-connector:jar:2.1.3:compile
[INFO] Adding OSGi bundle artifact: active project artifact:
	artifact = org.apache.tuscany.sca:tuscany-launcher:jar:2.0-SNAPSHOT:compile;
	project: MavenProject: org.apache.tuscany.sca:tuscany-launcher:2.0-SNAPSHOT @ <http://hudson.zones.apache.org/hudson/job/Tuscany-2x/ws/sca-2x/modules/launcher/pom.xml>
[INFO] Adding OSGi bundle artifact: active project artifact:
	artifact = org.apache.tuscany.sca:tuscany-implementation-spring:jar:2.0-SNAPSHOT:compile;
	project: MavenProject: org.apache.tuscany.sca:tuscany-implementation-spring:2.0-SNAPSHOT
@ <http://hudson.zones.apache.org/hudson/job/Tuscany-2x/ws/sca-2x/modules/implementation-spring/pom.xml>
[INFO] Adding OSGi bundle artifact: org.springframework:spring-asm:jar:3.0.2.RELEASE:compile
[INFO] Adding OSGi bundle artifact: org.eclipse.emf:common:jar:2.2.3:compile
[INFO] Adding JAR artifact: org.codehaus.woodstox:wstx-asl:jar:3.2.4:compile
[INFO] Writing generated manifest for: org.codehaus.woodstox:wstx-asl:jar:3.2.4:compile to
<http://hudson.zones.apache.org/hudson/job/Tuscany-2x/ws/sca-2x/distribution/all/target/modules/wstx-asl-3.2.4/META-INF/MANIFEST.MF>
[INFO] Adding OSGi bundle artifact: org.eclipse.core:runtime:jar:3.4.0-v20080512:runtime
[INFO] Adding OSGi bundle artifact: org.codehaus.groovy:groovy-all:jar:1.7.1:runtime
[INFO] Adding JAR artifact: org.apache.httpcomponents:httpcore-nio:jar:4.0.1:compile
[INFO] Writing generated manifest for: org.apache.httpcomponents:httpcore-nio:jar:4.0.1:compile
to <http://hudson.zones.apache.org/hudson/job/Tuscany-2x/ws/sca-2x/distribution/all/target/modules/httpcore-nio-4.0.1/META-INF/MANIFEST.MF>
[INFO] Adding JAR artifact: org.apache.ode:ode-bpel-runtime:jar:1.3.2:compile
[INFO] Writing generated manifest for: org.apache.ode:ode-bpel-runtime:jar:1.3.2:compile to
<http://hudson.zones.apache.org/hudson/job/Tuscany-2x/ws/sca-2x/distribution/all/target/modules/ode-bpel-runtime-1.3.2/META-INF/MANIFEST.MF>
[INFO] Overriding the manifest for org.apache.axis2:axis2-transport-local:jar:1.5.1:compile
[INFO] Adding JAR artifact: org.apache.axis2:axis2-transport-local:jar:1.5.1:compile
[INFO] Writing generated manifest for: org.apache.axis2:axis2-transport-local:jar:1.5.1:compile
to <http://hudson.zones.apache.org/hudson/job/Tuscany-2x/ws/sca-2x/distribution/all/target/modules/axis2-transport-local-1.5.1/META-INF/MANIFEST.MF>
[INFO] Adding JAR artifact: org.apache.openjpa:openjpa:jar:1.2.1:compile
[INFO] Writing generated manifest for: org.apache.openjpa:openjpa:jar:1.2.1:compile to <http://hudson.zones.apache.org/hudson/job/Tuscany-2x/ws/sca-2x/distribution/all/target/modules/openjpa-1.2.1/META-INF/MANIFEST.MF>
[INFO] Adding OSGi bundle artifact: org.eclipse.emf:ecore-change:jar:2.2.3:compile
[INFO] Adding JAR artifact: net.sf.saxon:saxon:jar:9.x:compile
[INFO] Writing generated manifest for: net.sf.saxon:saxon:jar:9.x:compile to <http://hudson.zones.apache.org/hudson/job/Tuscany-2x/ws/sca-2x/distribution/all/target/modules/saxon-9.x/META-INF/MANIFEST.MF>
[INFO] Adding JAR artifact: org.apache.geronimo.specs:geronimo-jta_1.0.1B_spec:jar:1.0:compile
Jul 26, 2010 9:00:36 AM org.apache.tuscany.maven.bundle.plugin.BundleUtil libraryManifest
WARNING: Duplicate or system package skipped: javax.transaction;version=1.0.0
Jul 26, 2010 9:00:36 AM org.apache.tuscany.maven.bundle.plugin.BundleUtil libraryManifest
WARNING: Duplicate or system package skipped: javax.transaction.xa;version=1.0.0
[INFO] Writing generated manifest for: org.apache.geronimo.specs:geronimo-jta_1.0.1B_spec:jar:1.0:compile
to <http://hudson.zones.apache.org/hudson/job/Tuscany-2x/ws/sca-2x/distribution/all/target/modules/geronimo-jta_1.0.1B_spec-1.0/META-INF/MANIFEST.MF>
[INFO] Adding OSGi bundle artifact: org.apache.geronimo.specs:geronimo-ejb_3.0_spec:jar:1.0.1:compile
[INFO] Adding JAR artifact: jdom:jdom:jar:1.0:compile
[INFO] Writing generated manifest for: jdom:jdom:jar:1.0:compile to <http://hudson.zones.apache.org/hudson/job/Tuscany-2x/ws/sca-2x/distribution/all/target/modules/jdom-1.0/META-INF/MANIFEST.MF>
[INFO] Adding JAR artifact: org.apache.ode:ode-bpel-compiler:jar:1.3.2:compile
[INFO] Writing generated manifest for: org.apache.ode:ode-bpel-compiler:jar:1.3.2:compile
to <http://hudson.zones.apache.org/hudson/job/Tuscany-2x/ws/sca-2x/distribution/all/target/modules/ode-bpel-compiler-1.3.2/META-INF/MANIFEST.MF>
[INFO] Adding JAR artifact: wsdl4j:wsdl4j:jar:1.6.2:compile
[INFO] Writing generated manifest for: wsdl4j:wsdl4j:jar:1.6.2:compile to <http://hudson.zones.apache.org/hudson/job/Tuscany-2x/ws/sca-2x/distribution/all/target/modules/wsdl4j-1.6.2/META-INF/MANIFEST.MF>
[INFO] Generating gateway bundle: <http://hudson.zones.apache.org/hudson/job/Tuscany-2x/ws/sca-2x/distribution/all/target/modules/tuscany-gateway-2.0-SNAPSHOT.jar>
[INFO] Generating target definition: <http://hudson.zones.apache.org/hudson/job/Tuscany-2x/ws/sca-2x/distribution/all/target/features/tuscany.target>
[INFO] Generating target definition: <http://hudson.zones.apache.org/hudson/job/Tuscany-2x/ws/sca-2x/distribution/all/target/features/tuscany-pde35.target>
[INFO] Generating configuation: <http://hudson.zones.apache.org/hudson/job/Tuscany-2x/ws/sca-2x/distribution/all/target/features/configuration/config.ini>
[INFO] Generating manifest jar: <http://hudson.zones.apache.org/hudson/job/Tuscany-2x/ws/sca-2x/distribution/all/target/features/tuscany-sca-manifest.jar>
[INFO] Generating equinox manifest jar: <http://hudson.zones.apache.org/hudson/job/Tuscany-2x/ws/sca-2x/distribution/all/target/features/tuscany-sca-equinox-manifest.jar>
[INFO] Generating ANT build path: <http://hudson.zones.apache.org/hudson/job/Tuscany-2x/ws/sca-2x/distribution/all/target/features/build-path.xml>
[INFO] [site:attach-descriptor {execution: default-attach-descriptor}]
[INFO] [assembly:single {execution: distribution-package}]
[INFO] Reading assembly descriptor: src/main/assembly/bin-distribution.xml
[INFO] Reading assembly descriptor: src/main/assembly/src.xml
[WARNING] Cannot include project artifact: org.apache.tuscany.sca:tuscany-distribution-all:pom:2.0-SNAPSHOT;
it doesn't have an associated file or directory.
[WARNING] Cannot include project artifact: org.apache.tuscany.sca:tuscany-distribution-all:pom:2.0-SNAPSHOT;
it doesn't have an associated file or directory.
[WARNING] Cannot include project artifact: org.apache.tuscany.sca:tuscany-distribution-all:pom:2.0-SNAPSHOT;
it doesn't have an associated file or directory.
[INFO] Building tar : <http://hudson.zones.apache.org/hudson/job/Tuscany-2x/ws/sca-2x/distribution/all/target/apache-tuscany-sca-all-2.0-SNAPSHOT.tar.gz>
[WARNING] Cannot include project artifact: org.apache.tuscany.sca:tuscany-distribution-all:pom:2.0-SNAPSHOT;
it doesn't have an associated file or directory.
[WARNING] Cannot include project artifact: org.apache.tuscany.sca:tuscany-distribution-all:pom:2.0-SNAPSHOT;
it doesn't have an associated file or directory.
[WARNING] Cannot include project artifact: org.apache.tuscany.sca:tuscany-distribution-all:pom:2.0-SNAPSHOT;
it doesn't have an associated file or directory.
[INFO] Building zip: <http://hudson.zones.apache.org/hudson/job/Tuscany-2x/ws/sca-2x/distribution/all/target/apache-tuscany-sca-all-2.0-SNAPSHOT.zip>
[INFO] Building tar : <http://hudson.zones.apache.org/hudson/job/Tuscany-2x/ws/sca-2x/distribution/all/target/apache-tuscany-sca-all-2.0-SNAPSHOT-src.tar.gz>
[INFO] Building zip: <http://hudson.zones.apache.org/hudson/job/Tuscany-2x/ws/sca-2x/distribution/all/target/apache-tuscany-sca-all-2.0-SNAPSHOT-src.zip>
[INFO] [install:install {execution: default-install}]
[INFO] Installing <http://hudson.zones.apache.org/hudson/job/Tuscany-2x/ws/sca-2x/distribution/all/pom.xml>
to /home/hudson/.m2/repository/org/apache/tuscany/sca/tuscany-distribution-all/2.0-SNAPSHOT/tuscany-distribution-all-2.0-SNAPSHOT.pom
[INFO] Installing <http://hudson.zones.apache.org/hudson/job/Tuscany-2x/ws/sca-2x/distribution/all/target/apache-tuscany-sca-all-2.0-SNAPSHOT.tar.gz>
to /home/hudson/.m2/repository/org/apache/tuscany/sca/tuscany-distribution-all/2.0-SNAPSHOT/tuscany-distribution-all-2.0-SNAPSHOT.tar.gz
[INFO] Installing <http://hudson.zones.apache.org/hudson/job/Tuscany-2x/ws/sca-2x/distribution/all/target/apache-tuscany-sca-all-2.0-SNAPSHOT.zip>
to /home/hudson/.m2/repository/org/apache/tuscany/sca/tuscany-distribution-all/2.0-SNAPSHOT/tuscany-distribution-all-2.0-SNAPSHOT.zip
[INFO] Installing <http://hudson.zones.apache.org/hudson/job/Tuscany-2x/ws/sca-2x/distribution/all/target/apache-tuscany-sca-all-2.0-SNAPSHOT-src.tar.gz>
to /home/hudson/.m2/repository/org/apache/tuscany/sca/tuscany-distribution-all/2.0-SNAPSHOT/tuscany-distribution-all-2.0-SNAPSHOT-src.tar.gz
[INFO] Installing <http://hudson.zones.apache.org/hudson/job/Tuscany-2x/ws/sca-2x/distribution/all/target/apache-tuscany-sca-all-2.0-SNAPSHOT-src.zip>
to /home/hudson/.m2/repository/org/apache/tuscany/sca/tuscany-distribution-all/2.0-SNAPSHOT/tuscany-distribution-all-2.0-SNAPSHOT-src.zip
[HUDSON] Archiving <http://hudson.zones.apache.org/hudson/job/Tuscany-2x/ws/sca-2x/distribution/all/pom.xml>
to /export/home/hudson/hudson/jobs/Tuscany-2x/modules/org.apache.tuscany.sca$tuscany-distribution-all/builds/2010-07-26_08-37-51/archive/org.apache.tuscany.sca/tuscany-distribution-all/2.0-SNAPSHOT/pom.xml
[HUDSON] Archiving /home/hudson/.m2/repository/org/apache/tuscany/sca/tuscany-distribution-all/2.0-SNAPSHOT/tuscany-distribution-all-2.0-SNAPSHOT.pom
to /export/home/hudson/hudson/jobs/Tuscany-2x/modules/org.apache.tuscany.sca$tuscany-distribution-all/builds/2010-07-26_08-37-51/archive/org.apache.tuscany.sca/tuscany-distribution-all/2.0-SNAPSHOT/tuscany-distribution-all-2.0-SNAPSHOT.pom
[HUDSON] Archiving <http://hudson.zones.apache.org/hudson/job/Tuscany-2x/ws/sca-2x/distribution/all/target/apache-tuscany-sca-all-2.0-SNAPSHOT.tar.gz>
to /export/home/hudson/hudson/jobs/Tuscany-2x/modules/org.apache.tuscany.sca$tuscany-distribution-all/builds/2010-07-26_08-37-51/archive/org.apache.tuscany.sca/tuscany-distribution-all/2.0-SNAPSHOT/apache-tuscany-sca-all-2.0-SNAPSHOT.tar.gz
[HUDSON] Archiving <http://hudson.zones.apache.org/hudson/job/Tuscany-2x/ws/sca-2x/distribution/all/target/apache-tuscany-sca-all-2.0-SNAPSHOT.zip>
to /export/home/hudson/hudson/jobs/Tuscany-2x/modules/org.apache.tuscany.sca$tuscany-distribution-all/builds/2010-07-26_08-37-51/archive/org.apache.tuscany.sca/tuscany-distribution-all/2.0-SNAPSHOT/apache-tuscany-sca-all-2.0-SNAPSHOT.zip
channel stopped
[INFO] ------------------------------------------------------------------------
2010-07-26 09:11:55.914::INFO:  Shutdown hook executing
2010-07-26 09:11:55.953::INFO:  Shutdown hook complete
[ERROR] FATAL ERROR
[INFO] ------------------------------------------------------------------------
[INFO] null
channel is already closed
[INFO] ------------------------------------------------------------------------
[INFO] Trace
java.lang.reflect.UndeclaredThrowableException
	at $Proxy2.isArchivingDisabled(Unknown Source)
	at hudson.maven.MavenBuildProxy$Filter.isArchivingDisabled(MavenBuildProxy.java:210)
	at hudson.maven.reporters.MavenArtifact.archive(MavenArtifact.java:192)
	at hudson.maven.reporters.MavenArtifactArchiver.postBuild(MavenArtifactArchiver.java:109)
	at hudson.maven.MavenModuleSetBuild$Builder.postModule(MavenModuleSetBuild.java:729)
	at hudson.maven.MavenBuilder$Adapter.fireLeaveModule(MavenBuilder.java:317)
	at hudson.maven.MavenBuilder$Adapter.postBuild(MavenBuilder.java:275)
	at org.apache.maven.lifecycle.LifecycleExecutorInterceptor.execute(LifecycleExecutorInterceptor.java:68)
	at org.apache.maven.DefaultMaven.doExecute(DefaultMaven.java:328)
	at org.apache.maven.DefaultMaven.execute(DefaultMaven.java:138)
	at org.apache.maven.cli.MavenCli.main(MavenCli.java:362)
	at sun.reflect.NativeMethodAccessorImpl.invoke0(Native Method)
	at sun.reflect.NativeMethodAccessorImpl.invoke(NativeMethodAccessorImpl.java:39)
	at sun.reflect.DelegatingMethodAccessorImpl.invoke(DelegatingMethodAccessorImpl.java:25)
	at java.lang.reflect.Method.invoke(Method.java:597)
	at org.codehaus.classworlds.Launcher.launchEnhanced(Launcher.java:315)
	at org.codehaus.classworlds.Launcher.launch(Launcher.java:255)
	at hudson.maven.agent.Main.launch(Main.java:165)
	at hudson.maven.MavenBuilder.call(MavenBuilder.java:165)
	at hudson.maven.MavenModuleSetBuild$Builder.call(MavenModuleSetBuild.java:696)
	at hudson.maven.MavenModuleSetBuild$Builder.call(MavenModuleSetBuild.java:640)
	at hudson.remoting.UserRequest.perform(UserRequest.java:114)
	at hudson.remoting.UserRequest.perform(UserRequest.java:48)
	at hudson.remoting.Request$2.run(Request.java:270)
	at java.util.concurrent.Executors$RunnableAdapter.call(Executors.java:441)
	at java.util.concurrent.FutureTask$Sync.innerRun(FutureTask.java:303)
	at java.util.concurrent.FutureTask.run(FutureTask.java:138)
	at java.util.concurrent.ThreadPoolExecutor$Worker.runTask(ThreadPoolExecutor.java:886)
	at java.util.concurrent.ThreadPoolExecutor$Worker.run(ThreadPoolExecutor.java:908)
	at java.lang.Thread.run(Thread.java:619)
Caused by: hudson.remoting.ChannelClosedException: channel is already closed
	at hudson.remoting.Channel.send(Channel.java:412)
	at hudson.remoting.Request.call(Request.java:105)
	at hudson.remoting.Channel.call(Channel.java:551)
	at hudson.remoting.RemoteInvocationHandler.invoke(RemoteInvocationHandler.java:158)
	... 30 more
[INFO] ------------------------------------------------------------------------
[INFO] Total time: 33 minutes 55 seconds
[INFO] Finished at: Mon Jul 26 09:11:55 UTC 2010
[INFO] Final Memory: 150M/730M
[INFO] ------------------------------------------------------------------------
2010-07-26 09:11:56.953::INFO:  Shutdown hook complete
2010-07-26 09:11:57.953::INFO:  Shutdown hook complete
2010-07-26 09:11:58.953::INFO:  Shutdown hook complete
2010-07-26 09:11:59.953::INFO:  Shutdown hook complete
2010-07-26 09:12:00.953::INFO:  Shutdown hook complete
2010-07-26 09:12:01.953::INFO:  Shutdown hook complete
2010-07-26 09:12:02.954::INFO:  Shutdown hook complete
ERROR: Aborted Maven execution for InterruptedException
java.lang.InterruptedException
	at java.lang.Object.wait(Native Method)
	at hudson.remoting.Request.call(Request.java:122)
	at hudson.remoting.Channel.call(Channel.java:555)
	at hudson.maven.ProcessCache$MavenProcess.call(ProcessCache.java:156)
	at hudson.maven.MavenModuleSetBuild$RunnerImpl.doRun(MavenModuleSetBuild.java:483)
	at hudson.model.AbstractBuild$AbstractRunner.run(AbstractBuild.java:416)
	at hudson.model.Run.run(Run.java:1257)
	at hudson.maven.MavenModuleSetBuild.run(MavenModuleSetBuild.java:306)
	at hudson.model.ResourceController.execute(ResourceController.java:88)
	at hudson.model.Executor.run(Executor.java:127)
FATAL: Failed to serialize hudson.model.Fingerprint#usages for class hudson.model.Fingerprint
java.lang.RuntimeException: Failed to serialize hudson.model.Fingerprint#usages for class
hudson.model.Fingerprint
	at hudson.util.RobustReflectionConverter$2.writeField(RobustReflectionConverter.java:164)
	at hudson.util.RobustReflectionConverter$2.visit(RobustReflectionConverter.java:135)
	at com.thoughtworks.xstream.converters.reflection.PureJavaReflectionProvider.visitSerializableFields(PureJavaReflectionProvider.java:130)
	at hudson.util.RobustReflectionConverter.doMarshal(RobustReflectionConverter.java:120)
	at hudson.util.RobustReflectionConverter.marshal(RobustReflectionConverter.java:94)
	at com.thoughtworks.xstream.core.AbstractReferenceMarshaller.convert(AbstractReferenceMarshaller.java:68)
	at com.thoughtworks.xstream.core.TreeMarshaller.convertAnother(TreeMarshaller.java:78)
	at com.thoughtworks.xstream.core.TreeMarshaller.convertAnother(TreeMarshaller.java:63)
	at com.thoughtworks.xstream.core.TreeMarshaller.start(TreeMarshaller.java:98)
	at com.thoughtworks.xstream.core.AbstractTreeMarshallingStrategy.marshal(AbstractTreeMarshallingStrategy.java:38)
	at com.thoughtworks.xstream.XStream.marshal(XStream.java:840)
	at com.thoughtworks.xstream.XStream.marshal(XStream.java:829)
	at com.thoughtworks.xstream.XStream.toXML(XStream.java:804)
	at hudson.XmlFile.write(XmlFile.java:165)
	at hudson.model.Fingerprint.save(Fingerprint.java:704)
	at hudson.model.Fingerprint.add(Fingerprint.java:666)
	at hudson.model.Fingerprint.add(Fingerprint.java:651)
	at hudson.maven.reporters.MavenFingerprinter.aggregate(MavenFingerprinter.java:175)
	at hudson.maven.MavenModuleSetBuild$RunnerImpl.post2(MavenModuleSetBuild.java:609)
	at hudson.model.AbstractBuild$AbstractRunner.post(AbstractBuild.java:528)
	at hudson.model.Run.run(Run.java:1280)
	at hudson.maven.MavenModuleSetBuild.run(MavenModuleSetBuild.java:306)
	at hudson.model.ResourceController.execute(ResourceController.java:88)
	at hudson.model.Executor.run(Executor.java:127)
Caused by: com.thoughtworks.xstream.io.StreamException:  : null
	at com.thoughtworks.xstream.core.util.QuickWriter.flush(QuickWriter.java:73)
	at com.thoughtworks.xstream.core.util.QuickWriter.write(QuickWriter.java:57)
	at com.thoughtworks.xstream.io.xml.PrettyPrintWriter.endNode(PrettyPrintWriter.java:282)
	at com.thoughtworks.xstream.io.WriterWrapper.endNode(WriterWrapper.java:37)
	at com.thoughtworks.xstream.io.path.PathTrackingWriter.endNode(PathTrackingWriter.java:48)
	at com.thoughtworks.xstream.converters.collections.MapConverter.marshal(MapConverter.java:60)
	at com.thoughtworks.xstream.core.AbstractReferenceMarshaller.convert(AbstractReferenceMarshaller.java:68)
	at com.thoughtworks.xstream.core.TreeMarshaller.convertAnother(TreeMarshaller.java:78)
	at com.thoughtworks.xstream.core.TreeMarshaller.convertAnother(TreeMarshaller.java:63)
	at hudson.util.RobustReflectionConverter.marshallField(RobustReflectionConverter.java:172)
	at hudson.util.RobustReflectionConverter$2.writeField(RobustReflectionConverter.java:160)
	... 23 more
Caused by: java.io.InterruptedIOException
	at java.io.FileOutputStream.writeBytes(Native Method)
	at java.io.FileOutputStream.write(FileOutputStream.java:260)
	at sun.nio.cs.StreamEncoder.writeBytes(StreamEncoder.java:202)
	at sun.nio.cs.StreamEncoder.implFlushBuffer(StreamEncoder.java:272)
	at sun.nio.cs.StreamEncoder.implFlush(StreamEncoder.java:276)
	at sun.nio.cs.StreamEncoder.flush(StreamEncoder.java:122)
	at java.io.OutputStreamWriter.flush(OutputStreamWriter.java:212)
	at java.io.BufferedWriter.flush(BufferedWriter.java:236)
	at hudson.util.AtomicFileWriter.flush(AtomicFileWriter.java:90)
	at com.thoughtworks.xstream.core.util.QuickWriter.flush(QuickWriter.java:71)
	... 33 more


Mime
View raw message