tuscany-commits mailing list archives

Site index · List index
Message view « Date » · « Thread »
Top « Date » · « Thread »
From Apache Hudson Server <hud...@hudson.zones.apache.org>
Subject Build failed in Hudson: Tuscany-2x » Apache Tuscany SCA Model Builders #773
Date Fri, 16 Jul 2010 00:19:28 GMT
See <http://hudson.zones.apache.org/hudson/job/Tuscany-2x/org.apache.tuscany.sca$tuscany-builder/773/changes>

Changes:

[bdaniel] Use binding type from system definitions to obtain mayProvide/alwaysProvide values

[bdaniel] Check extension type for unresolved service side intents, only throw a warning for
unresolved reference side intents

[slaws] Add new OSGi dependency required by changes at r964321

[bdaniel] Validate that the noListener intent isn't specified on a service

------------------------------------------
[INFO] ------------------------------------------------------------------------
[INFO] Building Apache Tuscany SCA Model Builders
[INFO]    task-segment: [clean, install]
[INFO] ------------------------------------------------------------------------
[INFO] [clean:clean {execution: default-clean}]
[INFO] Deleting <http://hudson.zones.apache.org/hudson/job/Tuscany-2x/org.apache.tuscany.sca$tuscany-builder/ws/target>
[INFO] [enforcer:enforce {execution: enforce-plugin-versions}]
[INFO] [resources:resources {execution: default-resources}]
[INFO] Using 'UTF-8' encoding to copy filtered resources.
[INFO] Copying 2 resources
[INFO] Copying 1 resource
[INFO] [compiler:compile {execution: default-compile}]
[INFO] Compiling 19 source files to <http://hudson.zones.apache.org/hudson/job/Tuscany-2x/org.apache.tuscany.sca$tuscany-builder/ws/target/classes>
[INFO] -------------------------------------------------------------
[ERROR] COMPILATION ERROR : 
[INFO] -------------------------------------------------------------
[ERROR] <http://hudson.zones.apache.org/hudson/job/Tuscany-2x/org.apache.tuscany.sca$tuscany-builder/ws/src/main/java/org/apache/tuscany/sca/builder/impl/CompositePolicyBuilderImpl.java>:[39,42]
package org.apache.tuscany.sca.assembly.xml does not exist

[ERROR] <http://hudson.zones.apache.org/hudson/job/Tuscany-2x/org.apache.tuscany.sca$tuscany-builder/ws/src/main/java/org/apache/tuscany/sca/builder/impl/CompositePolicyBuilderImpl.java>:[223,28]
cannot find symbol
symbol  : variable Constants
location: class org.apache.tuscany.sca.builder.impl.CompositePolicyBuilderImpl

[INFO] 2 errors 
[INFO] -------------------------------------------------------------
[HUDSON] Archiving <http://hudson.zones.apache.org/hudson/job/Tuscany-2x/org.apache.tuscany.sca$tuscany-builder/ws/pom.xml>
to /export/home/hudson/hudson/jobs/Tuscany-2x/modules/org.apache.tuscany.sca$tuscany-builder/builds/2010-07-16_00-16-08/archive/org.apache.tuscany.sca/tuscany-builder/2.0-SNAPSHOT/pom.xml
[INFO] ------------------------------------------------------------------------
[ERROR] BUILD FAILURE
[INFO] ------------------------------------------------------------------------
[INFO] Compilation failure

<http://hudson.zones.apache.org/hudson/job/Tuscany-2x/org.apache.tuscany.sca$tuscany-builder/ws/src/main/java/org/apache/tuscany/sca/builder/impl/CompositePolicyBuilderImpl.java>:[39,42]
package org.apache.tuscany.sca.assembly.xml does not exist

<http://hudson.zones.apache.org/hudson/job/Tuscany-2x/org.apache.tuscany.sca$tuscany-builder/ws/src/main/java/org/apache/tuscany/sca/builder/impl/CompositePolicyBuilderImpl.java>:[223,28]
cannot find symbol
symbol  : variable Constants
location: class org.apache.tuscany.sca.builder.impl.CompositePolicyBuilderImpl


[INFO] ------------------------------------------------------------------------
[INFO] For more information, run Maven with the -e switch
[INFO] ------------------------------------------------------------------------
[INFO] Total time: 1 minute 49 seconds
[INFO] Finished at: Fri Jul 16 00:18:30 UTC 2010
[INFO] Final Memory: 58M/716M
[INFO] ------------------------------------------------------------------------
Waiting for Hudson to finish collecting data


Mime
View raw message