uima-dev mailing list archives

Site index · List index
Message view « Date » · « Thread »
Top « Date » · « Thread »
From Apache Jenkins Server <jenk...@builds.apache.org>
Subject Build failed in Jenkins: UIMA-DUCC #717
Date Thu, 03 Mar 2016 20:42:37 GMT
See <https://builds.apache.org/job/UIMA-DUCC/717/>

------------------------------------------
[...truncated 3914 lines...]
[FINDBUGS] Successfully parsed file <https://builds.apache.org/job/UIMA-DUCC/ws/trunk/uima-ducc-container/target/findbugsXml.xml>
of module Apache UIMA DUCC: uima-ducc-container with 85 unique warnings and 6 duplicates.
[FINDBUGS] Computing warning deltas based on reference build #716
[INFO] 
[INFO] --- maven-enforcer-plugin:1.3.1:enforce (enforce-versions) @ uima-ducc-container ---
[INFO] 
[INFO] --- build-helper-maven-plugin:1.8:parse-version (parse-project-version) @ uima-ducc-container
---
[INFO] 
[INFO] --- uima-build-helper-maven-plugin:7:parse-date-time (set buildYear and buildMonth)
@ uima-ducc-container ---
[INFO] 
[INFO] --- maven-remote-resources-plugin:1.5:process (default) @ uima-ducc-container ---
[INFO] 
[INFO] --- maven-resources-plugin:2.6:resources (default-resources) @ uima-ducc-container
---
[INFO] Using 'UTF-8' encoding to copy filtered resources.
[INFO] Copying 0 resource
[INFO] Copying 3 resources
[INFO] Copying 3 resources
[INFO] 
[INFO] --- maven-compiler-plugin:3.1:compile (default-compile) @ uima-ducc-container ---
[INFO] Nothing to compile - all classes are up to date
[INFO] 
[INFO] --- cobertura-maven-plugin:2.7:instrument (default-cli) @ uima-ducc-container ---
[INFO] Cobertura 2.1.1 - GNU GPL License (NO WARRANTY) - See COPYRIGHT file
[INFO] Cobertura: Saved information on 154 classes.
[INFO] Cobertura: Saved information on 154 classes.

[ERROR] SLF4J: Class path contains multiple SLF4J bindings.
SLF4J: Found binding in [jar:file:/home/jenkins/jenkins-slave/maven-repositories/1/ch/qos/logback/logback-classic/1.0.13/logback-classic-1.0.13.jar!/org/slf4j/impl/StaticLoggerBinder.class]
SLF4J: Found binding in [jar:file:/home/jenkins/jenkins-slave/maven-repositories/1/org/slf4j/slf4j-log4j12/1.7.6/slf4j-log4j12-1.7.6.jar!/org/slf4j/impl/StaticLoggerBinder.class]
SLF4J: See http://www.slf4j.org/codes.html#multiple_bindings for an explanation.
SLF4J: Actual binding is of type [ch.qos.logback.classic.util.ContextSelectorStaticBinder]

[INFO] Instrumentation was successful.
[INFO] NOT adding cobertura ser file to attached artifacts list.
[INFO] 
[INFO] --- maven-resources-plugin:2.6:testResources (default-testResources) @ uima-ducc-container
---
[INFO] Using 'UTF-8' encoding to copy filtered resources.
[INFO] Copying 8 resources
[INFO] Copying 3 resources
[INFO] Copying 3 resources
[INFO] 
[INFO] --- maven-dependency-plugin:2.8:copy (copy jars) @ uima-ducc-container ---
[INFO] Configured Artifact: org.apache.uima:uima-ducc-user:?:jar
[INFO] Configured Artifact: org.apache.uima:uimaj-core:?:jar
[INFO] Configured Artifact: org.apache.uima:uimaj-as-core:?:jar
[INFO] Configured Artifact: org.springframework:spring-core:?:jar
[INFO] Configured Artifact: org.apache.xmlbeans:xmlbeans:?:jar
[INFO] Configured Artifact: com.thoughtworks.xstream:xstream:?:jar
[INFO] org.apache.uima:uima-ducc-user:2.1.0-SNAPSHOT:jar already exists in <https://builds.apache.org/job/UIMA-DUCC/ws/trunk/uima-ducc-container/target/test-classes>
[INFO] org.apache.uima:uimaj-core:2.8.1:jar already exists in <https://builds.apache.org/job/UIMA-DUCC/ws/trunk/uima-ducc-container/target/test-classes>
[INFO] org.apache.uima:uimaj-as-core:2.8.1-SNAPSHOT:jar already exists in <https://builds.apache.org/job/UIMA-DUCC/ws/trunk/uima-ducc-container/target/test-classes>
[INFO] org.springframework:spring-core:3.2.11.RELEASE:jar already exists in <https://builds.apache.org/job/UIMA-DUCC/ws/trunk/uima-ducc-container/target/test-classes>
[INFO] org.apache.xmlbeans:xmlbeans:2.5.0:jar already exists in <https://builds.apache.org/job/UIMA-DUCC/ws/trunk/uima-ducc-container/target/test-classes>
[INFO] com.thoughtworks.xstream:xstream:1.3.1:jar already exists in <https://builds.apache.org/job/UIMA-DUCC/ws/trunk/uima-ducc-container/target/test-classes>
[INFO] 
[INFO] --- maven-compiler-plugin:3.1:testCompile (default-testCompile) @ uima-ducc-container
---
[INFO] Nothing to compile - all classes are up to date
[INFO] 
[INFO] --- maven-surefire-plugin:2.16:test (default-test) @ uima-ducc-container ---
[INFO] Surefire report directory: <https://builds.apache.org/job/UIMA-DUCC/ws/trunk/uima-ducc-container/target/surefire-reports>

-------------------------------------------------------
 T E S T S
-------------------------------------------------------
Running org.apache.uima.ducc.container.jd.test.Test1
Tests run: 6, Failures: 0, Errors: 0, Skipped: 0, Time elapsed: 3.944 sec - in org.apache.uima.ducc.container.jd.test.Test1
Running org.apache.uima.ducc.container.jd.test.messagehandler.TestMessageHandler02b
Tests run: 1, Failures: 0, Errors: 0, Skipped: 0, Time elapsed: 0.001 sec - in org.apache.uima.ducc.container.jd.test.messagehandler.TestMessageHandler02b
Running org.apache.uima.ducc.container.jd.test.messagehandler.TestMessageHandler01
Tests run: 1, Failures: 0, Errors: 0, Skipped: 0, Time elapsed: 1.553 sec - in org.apache.uima.ducc.container.jd.test.messagehandler.TestMessageHandler01
Running org.apache.uima.ducc.container.jd.test.messagehandler.TestMessageHandler02a
Tests run: 1, Failures: 0, Errors: 0, Skipped: 0, Time elapsed: 0.002 sec - in org.apache.uima.ducc.container.jd.test.messagehandler.TestMessageHandler02a
Running org.apache.uima.ducc.container.jd.test.messagehandler.TestMessageHandler04
Tests run: 1, Failures: 0, Errors: 0, Skipped: 0, Time elapsed: 0.002 sec - in org.apache.uima.ducc.container.jd.test.messagehandler.TestMessageHandler04
Running org.apache.uima.ducc.container.jd.test.messagehandler.TestMessageHandler05a
Tests run: 1, Failures: 0, Errors: 0, Skipped: 0, Time elapsed: 0 sec - in org.apache.uima.ducc.container.jd.test.messagehandler.TestMessageHandler05a
Running org.apache.uima.ducc.container.jd.test.messagehandler.TestMessageHandler03
Tests run: 1, Failures: 0, Errors: 0, Skipped: 0, Time elapsed: 0.002 sec - in org.apache.uima.ducc.container.jd.test.messagehandler.TestMessageHandler03
Running org.apache.uima.ducc.container.jd.test.messagehandler.TestMessageHandler05b
Tests run: 1, Failures: 0, Errors: 0, Skipped: 0, Time elapsed: 0.002 sec - in org.apache.uima.ducc.container.jd.test.messagehandler.TestMessageHandler05b
Running org.apache.uima.ducc.container.jd.test.messagehandler.TestMessageHandler06
Tests run: 1, Failures: 0, Errors: 0, Skipped: 0, Time elapsed: 0.002 sec - in org.apache.uima.ducc.container.jd.test.messagehandler.TestMessageHandler06
Running org.apache.uima.ducc.container.jd.test.Test2
Tests run: 3, Failures: 0, Errors: 0, Skipped: 0, Time elapsed: 0.62 sec - in org.apache.uima.ducc.container.jd.test.Test2
Running org.apache.uima.ducc.container.jd.test.TestPerf
Tests run: 1, Failures: 0, Errors: 0, Skipped: 0, Time elapsed: 0.005 sec - in org.apache.uima.ducc.container.jd.test.TestPerf
Running org.apache.uima.ducc.container.jd.test.classloading.TestClassLoading
Tests run: 5, Failures: 0, Errors: 0, Skipped: 0, Time elapsed: 0.777 sec - in org.apache.uima.ducc.container.jd.test.classloading.TestClassLoading
Running org.apache.uima.ducc.container.jd.test.wi.tracker.TestWiTracker
Tests run: 1, Failures: 0, Errors: 0, Skipped: 0, Time elapsed: 0.341 sec - in org.apache.uima.ducc.container.jd.test.wi.tracker.TestWiTracker
Running org.apache.uima.ducc.container.jd.test.wi.fsm.TestWiFsm
Tests run: 6, Failures: 0, Errors: 0, Skipped: 0, Time elapsed: 0.017 sec - in org.apache.uima.ducc.container.jd.test.wi.fsm.TestWiFsm
Running org.apache.uima.ducc.container.jd.test.wi.statefile.TestWiStateFile
Tests run: 1, Failures: 0, Errors: 0, Skipped: 0, Time elapsed: 0.04 sec - in org.apache.uima.ducc.container.jd.test.wi.statefile.TestWiStateFile
Running org.apache.uima.ducc.container.jd.test.Test0
Tests run: 1, Failures: 0, Errors: 0, Skipped: 0, Time elapsed: 0 sec - in org.apache.uima.ducc.container.jd.test.Test0

Results :

Tests run: 32, Failures: 0, Errors: 0, Skipped: 0

[JENKINS] Recording test results
[INFO] 
[INFO] --- cobertura-maven-plugin:2.7:cobertura (default-cli) @ uima-ducc-container ---
[INFO] Cobertura 2.1.1 - GNU GPL License (NO WARRANTY) - See COPYRIGHT file
[INFO] Cobertura: Loaded information on 154 classes.
Report time: 1946ms

[INFO] Cobertura Report generation was successful.
[INFO] 
[INFO] --- maven-enforcer-plugin:1.3.1:enforce (enforce-versions) @ uima-ducc-container ---
[INFO] 
[INFO] --- build-helper-maven-plugin:1.8:parse-version (parse-project-version) @ uima-ducc-container
---
[INFO] 
[INFO] --- uima-build-helper-maven-plugin:7:parse-date-time (set buildYear and buildMonth)
@ uima-ducc-container ---
[WARNING] Failed to getClass for org.apache.maven.plugin.javadoc.JavadocReport
[INFO] 
[INFO] --- maven-javadoc-plugin:2.9.1:javadoc (default-cli) @ uima-ducc-container ---
[INFO] 
1 warning
[WARNING] Javadoc Warnings
[WARNING] warning: [options] bootstrap class path not set in conjunction with -source 1.5
[JENKINS] Archiving  javadoc
[INFO]                                                                         
[INFO] ------------------------------------------------------------------------
[INFO] Building Apache UIMA DUCC: uima-ducc-transport 2.1.0-SNAPSHOT
[INFO] ------------------------------------------------------------------------
[INFO] 
[INFO] --- maven-clean-plugin:2.5:clean (default-clean) @ uima-ducc-transport ---
[TASKS] Scanning folder '<https://builds.apache.org/job/UIMA-DUCC/ws/trunk/uima-ducc-transport'>
for files matching the pattern '**/*.java' - excludes: 
[TASKS] Found 190 files to scan for tasks
Found 12 open tasks.
[TASKS] Computing warning deltas based on reference build #713
[INFO] 
[INFO] --- maven-enforcer-plugin:1.3.1:enforce (enforce-versions) @ uima-ducc-transport ---
[INFO] 
[INFO] --- build-helper-maven-plugin:1.8:parse-version (parse-project-version) @ uima-ducc-transport
---
[INFO] 
[INFO] --- uima-build-helper-maven-plugin:7:parse-date-time (set buildYear and buildMonth)
@ uima-ducc-transport ---
[INFO] 
[INFO] --- maven-remote-resources-plugin:1.5:process (default) @ uima-ducc-transport ---
[INFO] 
[INFO] --- maven-resources-plugin:2.6:resources (default-resources) @ uima-ducc-transport
---
[INFO] Using 'UTF-8' encoding to copy filtered resources.
[INFO] Copying 0 resource
[INFO] Copying 3 resources
[INFO] 
[INFO] --- maven-compiler-plugin:3.1:compile (default-compile) @ uima-ducc-transport ---
[INFO] Changes detected - recompiling the module!
[INFO] Compiling 189 source files to <https://builds.apache.org/job/UIMA-DUCC/ws/trunk/uima-ducc-transport/target/classes>
[INFO] -------------------------------------------------------------
[WARNING] COMPILATION WARNING : 
[INFO] -------------------------------------------------------------
[WARNING] <https://builds.apache.org/job/UIMA-DUCC/ws/trunk/uima-ducc-transport/src/main/java/org/apache/uima/ducc/transport/event/common/DuccSchedulingInfo.java>:
<https://builds.apache.org/job/UIMA-DUCC/ws/trunk/uima-ducc-transport/src/main/java/org/apache/uima/ducc/transport/event/common/DuccSchedulingInfo.java>
uses or overrides a deprecated API.
[WARNING] <https://builds.apache.org/job/UIMA-DUCC/ws/trunk/uima-ducc-transport/src/main/java/org/apache/uima/ducc/transport/event/common/DuccSchedulingInfo.java>:
Recompile with -Xlint:deprecation for details.
[WARNING] <https://builds.apache.org/job/UIMA-DUCC/ws/trunk/uima-ducc-transport/src/main/java/org/apache/uima/ducc/transport/cmdline/ACommandLine.java>:
<https://builds.apache.org/job/UIMA-DUCC/ws/trunk/uima-ducc-transport/src/main/java/org/apache/uima/ducc/transport/cmdline/ACommandLine.java>
uses unchecked or unsafe operations.
[WARNING] <https://builds.apache.org/job/UIMA-DUCC/ws/trunk/uima-ducc-transport/src/main/java/org/apache/uima/ducc/transport/cmdline/ACommandLine.java>:
Recompile with -Xlint:unchecked for details.
[INFO] 4 warnings 
[INFO] -------------------------------------------------------------
[INFO] -------------------------------------------------------------
[ERROR] COMPILATION ERROR : 
[INFO] -------------------------------------------------------------
[ERROR] <https://builds.apache.org/job/UIMA-DUCC/ws/trunk/uima-ducc-transport/src/main/java/org/apache/uima/ducc/transport/configuration/jd/JobDriverConfiguration.java>:[127,51]
cannot find symbol
  symbol:   method setMaxIdleTimeMs(int)
  location: variable threadPool of type org.eclipse.jetty.util.thread.QueuedThreadPool
[ERROR] <https://builds.apache.org/job/UIMA-DUCC/ws/trunk/uima-ducc-transport/src/main/java/org/apache/uima/ducc/transport/configuration/jd/JobDriverConfiguration.java>:[133,31]
cannot find symbol
  symbol:   method setThreadPool(org.eclipse.jetty.util.thread.QueuedThreadPool)
  location: variable server of type org.eclipse.jetty.server.Server
[INFO] 2 errors 
[INFO] -------------------------------------------------------------
[INFO] ------------------------------------------------------------------------
[INFO] Reactor Summary:
[INFO] 
[INFO] uima-ducc-parent .................................. SUCCESS [24.606s]
[INFO] Apache UIMA DUCC: uima-ducc-user .................. SUCCESS [1:30.496s]
[INFO] Apache UIMA DUCC: uima-ducc-common ................ SUCCESS [1:50.840s]
[INFO] Apache UIMA DUCC: uima-ducc-container ............. SUCCESS [1:29.342s]
[INFO] Apache UIMA DUCC: uima-ducc-transport ............. FAILURE [5.839s]
[INFO] Apache UIMA DUCC: uima-ducc-cli ................... SKIPPED
[INFO] Apache UIMA DUCC: uima-ducc-pm .................... SKIPPED
[INFO] Apache UIMA DUCC: uima-ducc-rm .................... SKIPPED
[INFO] Apache UIMA DUCC: uima-ducc-sm .................... SKIPPED
[INFO] Apache UIMA DUCC: uima-ducc-database .............. SKIPPED
[INFO] Apache UIMA DUCC: uima-ducc-orchestrator .......... SKIPPED
[INFO] Apache UIMA DUCC: uima-ducc-agent ................. SKIPPED
[INFO] uima-ducc-duccdocs ................................ SKIPPED
[INFO] Apache UIMA DUCC: uima-ducc-web ................... SKIPPED
[INFO] Apache UIMA DUCC: uima-ducc-examples .............. SKIPPED
[INFO] uima-ducc-spawn ................................... SKIPPED
[INFO] Apache UIMA-DUCC: uima-ducc ....................... SKIPPED
[INFO] ------------------------------------------------------------------------
[INFO] BUILD FAILURE
[INFO] ------------------------------------------------------------------------
[INFO] Total time: 5:31.921s
[INFO] Finished at: Thu Mar 03 20:42:33 UTC 2016
[INFO] Final Memory: 118M/734M
[INFO] ------------------------------------------------------------------------
Waiting for Jenkins to finish collecting data
[ERROR] Failed to execute goal org.apache.maven.plugins:maven-compiler-plugin:3.1:compile
(default-compile) on project uima-ducc-transport: Compilation failure: Compilation failure:
[ERROR] <https://builds.apache.org/job/UIMA-DUCC/ws/trunk/uima-ducc-transport/src/main/java/org/apache/uima/ducc/transport/configuration/jd/JobDriverConfiguration.java>:[127,51]
cannot find symbol
[ERROR] symbol:   method setMaxIdleTimeMs(int)
[ERROR] location: variable threadPool of type org.eclipse.jetty.util.thread.QueuedThreadPool
[ERROR] <https://builds.apache.org/job/UIMA-DUCC/ws/trunk/uima-ducc-transport/src/main/java/org/apache/uima/ducc/transport/configuration/jd/JobDriverConfiguration.java>:[133,31]
cannot find symbol
[ERROR] symbol:   method setThreadPool(org.eclipse.jetty.util.thread.QueuedThreadPool)
[ERROR] location: variable server of type org.eclipse.jetty.server.Server
[ERROR] -> [Help 1]
[ERROR] 
[ERROR] To see the full stack trace of the errors, re-run Maven with the -e switch.
[ERROR] Re-run Maven using the -X switch to enable full debug logging.
[ERROR] 
[ERROR] For more information about the errors and possible solutions, please read the following
articles:
[ERROR] [Help 1] http://cwiki.apache.org/confluence/display/MAVEN/MojoFailureException
[ERROR] 
[ERROR] After correcting the problems, you can resume the build with the command
[ERROR]   mvn <goals> -rf :uima-ducc-transport
[JENKINS] Archiving <https://builds.apache.org/job/UIMA-DUCC/ws/trunk/uima-ducc-web/pom.xml>
to org.apache.uima/uima-ducc-web/2.1.0-SNAPSHOT/uima-ducc-web-2.1.0-SNAPSHOT.pom
No artifacts from UIMA-DUCC » Apache UIMA DUCC: uima-ducc-web #713 to compare, so performing
full copy of artifacts
[JENKINS] Archiving <https://builds.apache.org/job/UIMA-DUCC/ws/trunk/uima-ducc-rm/pom.xml>
to org.apache.uima/uima-ducc-rm/2.1.0-SNAPSHOT/uima-ducc-rm-2.1.0-SNAPSHOT.pom
No artifacts from UIMA-DUCC » Apache UIMA DUCC: uima-ducc-rm #713 to compare, so performing
full copy of artifacts
[JENKINS] Archiving <https://builds.apache.org/job/UIMA-DUCC/ws/trunk/uima-ducc-sm/pom.xml>
to org.apache.uima/uima-ducc-sm/2.1.0-SNAPSHOT/uima-ducc-sm-2.1.0-SNAPSHOT.pom
No artifacts from UIMA-DUCC » Apache UIMA DUCC: uima-ducc-sm #713 to compare, so performing
full copy of artifacts
[JENKINS] Archiving <https://builds.apache.org/job/UIMA-DUCC/ws/trunk/uima-ducc-parent/pom.xml>
to org.apache.uima/uima-ducc-parent/2.1.0-SNAPSHOT/uima-ducc-parent-2.1.0-SNAPSHOT.pom
[JENKINS] Archiving <https://builds.apache.org/job/UIMA-DUCC/ws/trunk/uima-ducc-spawn/pom.xml>
to org.apache.uima/uima-ducc-spawn/2.1.0-SNAPSHOT/uima-ducc-spawn-2.1.0-SNAPSHOT.pom
No artifacts from UIMA-DUCC » uima-ducc-spawn #713 to compare, so performing full copy of
artifacts
[JENKINS] Archiving <https://builds.apache.org/job/UIMA-DUCC/ws/trunk/uima-ducc-orchestrator/pom.xml>
to org.apache.uima/uima-ducc-orchestrator/2.1.0-SNAPSHOT/uima-ducc-orchestrator-2.1.0-SNAPSHOT.pom
No artifacts from UIMA-DUCC » Apache UIMA DUCC: uima-ducc-orchestrator #713 to compare, so
performing full copy of artifacts
[JENKINS] Archiving <https://builds.apache.org/job/UIMA-DUCC/ws/trunk/uima-ducc-container/pom.xml>
to org.apache.uima/uima-ducc-container/2.1.0-SNAPSHOT/uima-ducc-container-2.1.0-SNAPSHOT.pom
[JENKINS] Archiving <https://builds.apache.org/job/UIMA-DUCC/ws/trunk/uima-ducc-container/target/uima-ducc-container-2.1.0-SNAPSHOT.jar>
to org.apache.uima/uima-ducc-container/2.1.0-SNAPSHOT/uima-ducc-container-2.1.0-SNAPSHOT.jar
[JENKINS] Archiving <https://builds.apache.org/job/UIMA-DUCC/ws/trunk/uima-ducc-examples/pom.xml>
to org.apache.uima/uima-ducc-examples/2.1.0-SNAPSHOT/uima-ducc-examples-2.1.0-SNAPSHOT.pom
No artifacts from UIMA-DUCC » Apache UIMA DUCC: uima-ducc-examples #713 to compare, so performing
full copy of artifacts
[JENKINS] Archiving <https://builds.apache.org/job/UIMA-DUCC/ws/trunk/uima-ducc-common/pom.xml>
to org.apache.uima/uima-ducc-common/2.1.0-SNAPSHOT/uima-ducc-common-2.1.0-SNAPSHOT.pom
[JENKINS] Archiving <https://builds.apache.org/job/UIMA-DUCC/ws/trunk/uima-ducc-common/target/uima-ducc-common-2.1.0-SNAPSHOT.jar>
to org.apache.uima/uima-ducc-common/2.1.0-SNAPSHOT/uima-ducc-common-2.1.0-SNAPSHOT.jar
[JENKINS] Archiving <https://builds.apache.org/job/UIMA-DUCC/ws/trunk/uima-ducc-duccdocs/pom.xml>
to org.apache.uima/uima-ducc-duccdocs/2.1.0-SNAPSHOT/uima-ducc-duccdocs-2.1.0-SNAPSHOT.pom
No artifacts from UIMA-DUCC » uima-ducc-duccdocs #713 to compare, so performing full copy
of artifacts
[JENKINS] Archiving <https://builds.apache.org/job/UIMA-DUCC/ws/trunk/uima-ducc-user/pom.xml>
to org.apache.uima/uima-ducc-user/2.1.0-SNAPSHOT/uima-ducc-user-2.1.0-SNAPSHOT.pom
[JENKINS] Archiving <https://builds.apache.org/job/UIMA-DUCC/ws/trunk/uima-ducc-user/target/uima-ducc-user-2.1.0-SNAPSHOT.jar>
to org.apache.uima/uima-ducc-user/2.1.0-SNAPSHOT/uima-ducc-user-2.1.0-SNAPSHOT.jar
[JENKINS] Archiving <https://builds.apache.org/job/UIMA-DUCC/ws/trunk/uima-ducc-agent/pom.xml>
to org.apache.uima/uima-ducc-agent/2.1.0-SNAPSHOT/uima-ducc-agent-2.1.0-SNAPSHOT.pom
No artifacts from UIMA-DUCC » Apache UIMA DUCC: uima-ducc-agent #713 to compare, so performing
full copy of artifacts
[JENKINS] Archiving <https://builds.apache.org/job/UIMA-DUCC/ws/trunk/uima-ducc-cli/pom.xml>
to org.apache.uima/uima-ducc-cli/2.1.0-SNAPSHOT/uima-ducc-cli-2.1.0-SNAPSHOT.pom
No artifacts from UIMA-DUCC » Apache UIMA DUCC: uima-ducc-cli #713 to compare, so performing
full copy of artifacts
[JENKINS] Archiving <https://builds.apache.org/job/UIMA-DUCC/ws/trunk/uima-ducc-database/pom.xml>
to org.apache.uima/uima-ducc-database/2.1.0-SNAPSHOT/uima-ducc-database-2.1.0-SNAPSHOT.pom
No artifacts from UIMA-DUCC » Apache UIMA DUCC: uima-ducc-database #713 to compare, so performing
full copy of artifacts
[JENKINS] Archiving <https://builds.apache.org/job/UIMA-DUCC/ws/trunk/pom.xml> to org.apache.uima/uima-ducc/2.1.0-SNAPSHOT/uima-ducc-2.1.0-SNAPSHOT.pom
[JENKINS] Archiving <https://builds.apache.org/job/UIMA-DUCC/ws/trunk/uima-ducc-pm/pom.xml>
to org.apache.uima/uima-ducc-pm/2.1.0-SNAPSHOT/uima-ducc-pm-2.1.0-SNAPSHOT.pom
No artifacts from UIMA-DUCC » Apache UIMA DUCC: uima-ducc-pm #713 to compare, so performing
full copy of artifacts
[JENKINS] Archiving <https://builds.apache.org/job/UIMA-DUCC/ws/trunk/uima-ducc-transport/pom.xml>
to org.apache.uima/uima-ducc-transport/2.1.0-SNAPSHOT/uima-ducc-transport-2.1.0-SNAPSHOT.pom
No artifacts from UIMA-DUCC » Apache UIMA DUCC: uima-ducc-transport #713 to compare, so performing
full copy of artifacts
Sending e-mails to: dev@uima.apache.org
channel stopped
[WARNINGS] Skipping publisher since build result is FAILURE

Mime
View raw message