uima-dev mailing list archives

Site index · List index
Message view « Date » · « Thread »
Top « Date » · « Thread »
From Apache Jenkins Server <jenk...@builds.apache.org>
Subject Build failed in Jenkins: UIMA-Ruta » Apache UIMA Ruta Eclipse: ruta-ep-ide #698
Date Wed, 02 Mar 2016 16:26:15 GMT
See <https://builds.apache.org/job/UIMA-Ruta/org.apache.uima$ruta-ep-ide/698/>

------------------------------------------
[...truncated 14731 lines...]
[DEBUG] Stale source detected: <https://builds.apache.org/job/UIMA-Ruta/org.apache.uima$ruta-ep-ide/ws/src/main/java/org/apache/uima/ruta/ide/parser/ast/RutaImportTypesStatement.java>
[DEBUG] Stale source detected: <https://builds.apache.org/job/UIMA-Ruta/org.apache.uima$ruta-ep-ide/ws/src/main/java/org/apache/uima/ruta/ide/core/packages/RutaCheckBuilder.java>
[DEBUG] Stale source detected: <https://builds.apache.org/job/UIMA-Ruta/org.apache.uima$ruta-ep-ide/ws/src/main/java/org/apache/uima/ruta/ide/parser/ast/ActionFactory.java>
[DEBUG] Stale source detected: <https://builds.apache.org/job/UIMA-Ruta/org.apache.uima$ruta-ep-ide/ws/src/main/java/org/apache/uima/ruta/ide/core/builder/RutaBuildException.java>
[DEBUG] Stale source detected: <https://builds.apache.org/job/UIMA-Ruta/org.apache.uima$ruta-ep-ide/ws/src/main/java/org/apache/uima/ruta/ide/core/search/RutaCallProcessor.java>
[DEBUG] Stale source detected: <https://builds.apache.org/job/UIMA-Ruta/org.apache.uima$ruta-ep-ide/ws/src/main/java/org/apache/uima/ruta/ide/parser/ast/ScriptFactory.java>
[DEBUG] Stale source detected: <https://builds.apache.org/job/UIMA-Ruta/org.apache.uima$ruta-ep-ide/ws/src/main/java/org/apache/uima/ruta/ide/core/builder/RutaProjectUtils.java>
[DEBUG] Stale source detected: <https://builds.apache.org/job/UIMA-Ruta/org.apache.uima$ruta-ep-ide/ws/src/main/java/org/apache/uima/ruta/ide/core/extensions/IIDENumberFunctionExtension.java>
[DEBUG] Stale source detected: <https://builds.apache.org/job/UIMA-Ruta/org.apache.uima$ruta-ep-ide/ws/src/main/java/org/apache/uima/ruta/ide/core/codeassist/RutaReferenceVisitor.java>
[DEBUG] Stale source detected: <https://builds.apache.org/job/UIMA-Ruta/org.apache.uima$ruta-ep-ide/ws/src/main/java/org/apache/uima/ruta/ide/parser/ast/RutaUnaryArithmeticExpression.java>
[DEBUG] Stale source detected: <https://builds.apache.org/job/UIMA-Ruta/org.apache.uima$ruta-ep-ide/ws/src/main/java/org/apache/uima/ruta/ide/parser/ast/RutaBinaryArithmeticExpression.java>
[DEBUG] Stale source detected: <https://builds.apache.org/job/UIMA-Ruta/org.apache.uima$ruta-ep-ide/ws/src/main/java/org/apache/uima/ruta/ide/parser/ast/RutaBlockDeclaration.java>
[DEBUG] Stale source detected: <https://builds.apache.org/job/UIMA-Ruta/org.apache.uima$ruta-ep-ide/ws/src/main/java/org/apache/uima/ruta/ide/core/codeassist/RutaResolver.java>
[DEBUG] Stale source detected: <https://builds.apache.org/job/UIMA-Ruta/org.apache.uima$ruta-ep-ide/ws/src/main/java/org/apache/uima/ruta/ide/core/RutaMatchLocatorParser.java>
[DEBUG] Stale source detected: <https://builds.apache.org/job/UIMA-Ruta/org.apache.uima$ruta-ep-ide/ws/src/main/java/org/apache/uima/ruta/ide/core/extensions/IIDEBooleanFunctionExtension.java>
[DEBUG] Stale source detected: <https://builds.apache.org/job/UIMA-Ruta/org.apache.uima$ruta-ep-ide/ws/src/main/java/org/apache/uima/ruta/ide/parser/ast/RutaVariableDeclaration.java>
[DEBUG] Stale source detected: <https://builds.apache.org/job/UIMA-Ruta/org.apache.uima$ruta-ep-ide/ws/src/main/java/org/apache/uima/ruta/ide/core/extensions/IIDETypeFunctionExtension.java>
[DEBUG] Stale source detected: <https://builds.apache.org/job/UIMA-Ruta/org.apache.uima$ruta-ep-ide/ws/src/main/java/org/apache/uima/ruta/ide/parser/ast/RutaStructureAction.java>
[DEBUG] Stale source detected: <https://builds.apache.org/job/UIMA-Ruta/org.apache.uima$ruta-ep-ide/ws/src/main/java/org/apache/uima/ruta/ide/core/IRutaKeywords.java>
[DEBUG] Stale source detected: <https://builds.apache.org/job/UIMA-Ruta/org.apache.uima$ruta-ep-ide/ws/src/main/java/org/apache/uima/ruta/ide/core/extensions/ISelectionExtension.java>
[DEBUG] Stale source detected: <https://builds.apache.org/job/UIMA-Ruta/org.apache.uima$ruta-ep-ide/ws/src/main/java/org/apache/uima/ruta/ide/parser/ast/RutaExpressionList.java>
[DEBUG] Stale source detected: <https://builds.apache.org/job/UIMA-Ruta/org.apache.uima$ruta-ep-ide/ws/target/generated-sources/antlr3/org/apache/uima/ruta/ide/core/parser/RutaParser.java>
[DEBUG] Stale source detected: <https://builds.apache.org/job/UIMA-Ruta/org.apache.uima$ruta-ep-ide/ws/src/main/java/org/apache/uima/ruta/ide/core/packages/RutaBuildPathPackageCollector.java>
[DEBUG] Stale source detected: <https://builds.apache.org/job/UIMA-Ruta/org.apache.uima$ruta-ep-ide/ws/src/main/java/org/apache/uima/ruta/ide/parser/ast/RutaConditionConstants.java>
[DEBUG] Stale source detected: <https://builds.apache.org/job/UIMA-Ruta/org.apache.uima$ruta-ep-ide/ws/src/main/java/org/apache/uima/ruta/ide/core/parser/DLTKRutaErrorReporter.java>
[DEBUG] Stale source detected: <https://builds.apache.org/job/UIMA-Ruta/org.apache.uima$ruta-ep-ide/ws/src/main/java/org/apache/uima/ruta/ide/parser/ast/RutaDeclareDeclarationsStatement.java>
[DEBUG] Stale source detected: <https://builds.apache.org/job/UIMA-Ruta/org.apache.uima$ruta-ep-ide/ws/src/main/java/org/apache/uima/ruta/ide/core/codeassist/SelectionOnKeywordOrFunction.java>
[DEBUG] Stale source detected: <https://builds.apache.org/job/UIMA-Ruta/org.apache.uima$ruta-ep-ide/ws/src/main/java/org/apache/uima/ruta/ide/core/codeassist/TMAutoCompletionToolkit.java>
[DEBUG] Stale source detected: <https://builds.apache.org/job/UIMA-Ruta/org.apache.uima$ruta-ep-ide/ws/src/main/java/org/apache/uima/ruta/ide/parser/ast/RutaActionConstants.java>
[DEBUG] Stale source detected: <https://builds.apache.org/job/UIMA-Ruta/org.apache.uima$ruta-ep-ide/ws/src/main/java/org/apache/uima/ruta/ide/core/codeassist/RutaReferenceDeclarationVisitor.java>
[DEBUG] Stale source detected: <https://builds.apache.org/job/UIMA-Ruta/org.apache.uima$ruta-ep-ide/ws/src/main/java/org/apache/uima/ruta/ide/core/RutaBuildpathVariableInitializer.java>
[DEBUG] Stale source detected: <https://builds.apache.org/job/UIMA-Ruta/org.apache.uima$ruta-ep-ide/ws/src/main/java/org/apache/uima/ruta/ide/parser/ast/RutaModuleDeclaration.java>
[DEBUG] Stale source detected: <https://builds.apache.org/job/UIMA-Ruta/org.apache.uima$ruta-ep-ide/ws/src/main/java/org/apache/uima/ruta/ide/core/RutaLanguageToolkit.java>
[DEBUG] Stale source detected: <https://builds.apache.org/job/UIMA-Ruta/org.apache.uima$ruta-ep-ide/ws/src/main/java/org/apache/uima/ruta/ide/parser/ast/RutaAction.java>
[DEBUG] Stale source detected: <https://builds.apache.org/job/UIMA-Ruta/org.apache.uima$ruta-ep-ide/ws/src/main/java/org/apache/uima/ruta/ide/core/RutaProblems.java>
[DEBUG] Stale source detected: <https://builds.apache.org/job/UIMA-Ruta/org.apache.uima$ruta-ep-ide/ws/src/main/java/org/apache/uima/ruta/ide/core/codeassist/CompletionOnKeywordArgumentOrFunctionArgument.java>
[DEBUG] Stale source detected: <https://builds.apache.org/job/UIMA-Ruta/org.apache.uima$ruta-ep-ide/ws/src/main/java/org/apache/uima/ruta/ide/parser/ast/RutaStatement.java>
[DEBUG] Stale source detected: <https://builds.apache.org/job/UIMA-Ruta/org.apache.uima$ruta-ep-ide/ws/src/main/java/org/apache/uima/ruta/ide/core/codeassist/CompletionOnKeywordOrFunction.java>
[DEBUG] Stale source detected: <https://builds.apache.org/job/UIMA-Ruta/org.apache.uima$ruta-ep-ide/ws/src/main/java/org/apache/uima/ruta/ide/parser/ast/RutaQuantifierLiteralExpression.java>
[DEBUG] Stale source detected: <https://builds.apache.org/job/UIMA-Ruta/org.apache.uima$ruta-ep-ide/ws/src/main/java/org/apache/uima/ruta/ide/core/codeassist/SelectionOnNode.java>
[DEBUG] Stale source detected: <https://builds.apache.org/job/UIMA-Ruta/org.apache.uima$ruta-ep-ide/ws/src/main/java/org/apache/uima/ruta/ide/core/codeassist/CompletionOnVariable.java>
[DEBUG] Stale source detected: <https://builds.apache.org/job/UIMA-Ruta/org.apache.uima$ruta-ep-ide/ws/src/main/java/org/apache/uima/ruta/ide/core/extensions/IRutaExtension.java>
[DEBUG] Stale source detected: <https://builds.apache.org/job/UIMA-Ruta/org.apache.uima$ruta-ep-ide/ws/src/main/java/org/apache/uima/ruta/ide/core/RutaConstants.java>
[DEBUG] Stale source detected: <https://builds.apache.org/job/UIMA-Ruta/org.apache.uima$ruta-ep-ide/ws/src/main/java/org/apache/uima/ruta/ide/core/extensions/ICompletionExtension.java>
[DEBUG] Stale source detected: <https://builds.apache.org/job/UIMA-Ruta/org.apache.uima$ruta-ep-ide/ws/src/main/java/org/apache/uima/ruta/ide/parser/ast/ConditionFactory.java>
[DEBUG] Stale source detected: <https://builds.apache.org/job/UIMA-Ruta/org.apache.uima$ruta-ep-ide/ws/src/main/java/org/apache/uima/ruta/ide/core/search/RutaMatchLocator.java>
[DEBUG] Stale source detected: <https://builds.apache.org/job/UIMA-Ruta/org.apache.uima$ruta-ep-ide/ws/src/main/java/org/apache/uima/ruta/ide/parser/ast/RutaDeclarationsStatement.java>
[DEBUG] Stale source detected: <https://builds.apache.org/job/UIMA-Ruta/org.apache.uima$ruta-ep-ide/ws/src/main/java/org/apache/uima/ruta/ide/parser/ast/RutaBasicAnnotationType.java>
[DEBUG] Stale source detected: <https://builds.apache.org/job/UIMA-Ruta/org.apache.uima$ruta-ep-ide/ws/src/main/java/org/apache/uima/ruta/ide/core/extensions/IIDEActionExtension.java>
[DEBUG] Stale source detected: <https://builds.apache.org/job/UIMA-Ruta/org.apache.uima$ruta-ep-ide/ws/src/main/java/org/apache/uima/ruta/ide/core/codeassist/RutaRuleIdVisitor.java>
[DEBUG] Stale source detected: <https://builds.apache.org/job/UIMA-Ruta/org.apache.uima$ruta-ep-ide/ws/src/main/java/org/apache/uima/ruta/ide/core/extensions/IRutaCheckerProblemFactory.java>
[DEBUG] Stale source detected: <https://builds.apache.org/job/UIMA-Ruta/org.apache.uima$ruta-ep-ide/ws/src/main/java/org/apache/uima/ruta/ide/core/codeassist/RutaSelectionParser.java>
[DEBUG] Stale source detected: <https://builds.apache.org/job/UIMA-Ruta/org.apache.uima$ruta-ep-ide/ws/src/main/java/org/apache/uima/ruta/ide/parser/ast/RutaTypeConstants.java>
[DEBUG] Stale source detected: <https://builds.apache.org/job/UIMA-Ruta/org.apache.uima$ruta-ep-ide/ws/src/main/java/org/apache/uima/ruta/ide/core/extensions/IMixinBuildVisitorExtension.java>
[DEBUG] Stale source detected: <https://builds.apache.org/job/UIMA-Ruta/org.apache.uima$ruta-ep-ide/ws/src/main/java/org/apache/uima/ruta/ide/parser/ast/RutaScript.java>
[DEBUG] Stale source detected: <https://builds.apache.org/job/UIMA-Ruta/org.apache.uima$ruta-ep-ide/ws/src/main/java/org/apache/uima/ruta/ide/core/builder/RutaBuilder.java>
[DEBUG] Stale source detected: <https://builds.apache.org/job/UIMA-Ruta/org.apache.uima$ruta-ep-ide/ws/src/main/java/org/apache/uima/ruta/ide/core/codeassist/RutaAssistParser.java>
[DEBUG] Stale source detected: <https://builds.apache.org/job/UIMA-Ruta/org.apache.uima$ruta-ep-ide/ws/src/main/java/org/apache/uima/ruta/ide/parser/ast/RutaFeatureDeclaration.java>
[DEBUG] Stale source detected: <https://builds.apache.org/job/UIMA-Ruta/org.apache.uima$ruta-ep-ide/ws/src/main/java/org/apache/uima/ruta/ide/core/extensions/IIDEConditionExtension.java>
[DEBUG] Stale source detected: <https://builds.apache.org/job/UIMA-Ruta/org.apache.uima$ruta-ep-ide/ws/src/main/java/org/apache/uima/ruta/ide/parser/ast/AbstractFactory.java>
[INFO] Changes detected - recompiling the module!
[DEBUG] Classpath:
[DEBUG]  <https://builds.apache.org/job/UIMA-Ruta/org.apache.uima$ruta-ep-ide/ws/target/classes>
[DEBUG]  /home/jenkins/jenkins-slave/maven-repositories/1/org/eclipse/core/runtime/3.11.1/runtime-3.11.1.jar
[DEBUG]  /home/jenkins/jenkins-slave/maven-repositories/1/org/eclipse/osgi/3.10.101/osgi-3.10.101.jar
[DEBUG]  /home/jenkins/jenkins-slave/maven-repositories/1/org/eclipse/equinox/common/3.7.0/common-3.7.0.jar
[DEBUG]  /home/jenkins/jenkins-slave/maven-repositories/1/org/eclipse/core/jobs/3.7.0/jobs-3.7.0.jar
[DEBUG]  /home/jenkins/jenkins-slave/maven-repositories/1/org/eclipse/equinox/registry/3.6.0/registry-3.6.0.jar
[DEBUG]  /home/jenkins/jenkins-slave/maven-repositories/1/org/eclipse/core/resources/3.10.1/resources-3.10.1.jar
[DEBUG]  /home/jenkins/jenkins-slave/maven-repositories/1/org/eclipse/core/expressions/3.5.0/expressions-3.5.0.jar
[DEBUG]  /home/jenkins/jenkins-slave/maven-repositories/1/org/eclipse/core/filesystem/1.5.0/filesystem-1.5.0.jar
[DEBUG]  /home/jenkins/jenkins-slave/maven-repositories/1/org/eclipse/ui/3.107.0/ui-3.107.0.jar
[DEBUG]  /home/jenkins/jenkins-slave/maven-repositories/1/org/eclipse/swt/3.104.1/swt-3.104.1.jar
[DEBUG]  /home/jenkins/jenkins-slave/maven-repositories/1/org/eclipse/jface/3.11.0/jface-3.11.0.jar
[DEBUG]  /home/jenkins/jenkins-slave/maven-repositories/1/org/eclipse/core/commands/3.7.0/commands-3.7.0.jar
[DEBUG]  /home/jenkins/jenkins-slave/maven-repositories/1/org/eclipse/ui/workbench/3.107.0/workbench-3.107.0.jar
[DEBUG]  /home/jenkins/jenkins-slave/maven-repositories/1/org/eclipse/help/3.6.0/help-3.6.0.jar
[DEBUG]  /home/jenkins/jenkins-slave/maven-repositories/1/org/eclipse/jface/databinding/1.7.0/databinding-1.7.0.jar
[DEBUG]  /home/jenkins/jenkins-slave/maven-repositories/1/org/eclipse/core/databinding/1.5.0/databinding-1.5.0.jar
[DEBUG]  /home/jenkins/jenkins-slave/maven-repositories/1/org/eclipse/core/databinding/property/1.5.0/property-1.5.0.jar
[DEBUG]  /home/jenkins/jenkins-slave/maven-repositories/1/org/eclipse/core/databinding/observable/1.5.0/observable-1.5.0.jar
[DEBUG]  /home/jenkins/jenkins-slave/maven-repositories/1/org/eclipse/e4/core/services/2.0.0/services-2.0.0.jar
[DEBUG]  /home/jenkins/jenkins-slave/maven-repositories/1/org/eclipse/e4/core/di/1.5.0/di-1.5.0.jar
[DEBUG]  /home/jenkins/jenkins-slave/maven-repositories/1/org/eclipse/e4/ui/workbench/swt/0.13.0/swt-0.13.0.jar
[DEBUG]  /home/jenkins/jenkins-slave/maven-repositories/1/org/w3c/css/sac/1.3.1/sac-1.3.1.jar
[DEBUG]  /home/jenkins/jenkins-slave/maven-repositories/1/org/eclipse/osgi/services/3.5.0/services-3.5.0.jar
[DEBUG]  /home/jenkins/jenkins-slave/maven-repositories/1/org/eclipse/e4/core/commands/0.11.0/commands-0.11.0.jar
[DEBUG]  /home/jenkins/jenkins-slave/maven-repositories/1/org/eclipse/e4/ui/widgets/1.1.0/widgets-1.1.0.jar
[DEBUG]  /home/jenkins/jenkins-slave/maven-repositories/1/org/eclipse/e4/core/di/extensions/0.13.0/extensions-0.13.0.jar
[DEBUG]  /home/jenkins/jenkins-slave/maven-repositories/1/org/eclipse/e4/ui/di/1.1.0/di-1.1.0.jar
[DEBUG]  /home/jenkins/jenkins-slave/maven-repositories/1/org/eclipse/e4/ui/model/workbench/1.1.100/workbench-1.1.100.jar
[DEBUG]  /home/jenkins/jenkins-slave/maven-repositories/1/org/eclipse/e4/ui/css/swt/theme/0.10.0/theme-0.10.0.jar
[DEBUG]  /home/jenkins/jenkins-slave/maven-repositories/1/org/eclipse/e4/ui/bindings/0.11.0/bindings-0.11.0.jar
[DEBUG]  /home/jenkins/jenkins-slave/maven-repositories/1/org/eclipse/e4/ui/css/swt/0.12.0/swt-0.12.0.jar
[DEBUG]  /home/jenkins/jenkins-slave/maven-repositories/1/org/eclipse/e4/ui/css/core/0.11.0/core-0.11.0.jar
[DEBUG]  /home/jenkins/jenkins-slave/maven-repositories/1/org/eclipse/e4/ui/workbench3/0.13.0/workbench3-0.13.0.jar
[DEBUG]  /home/jenkins/jenkins-slave/maven-repositories/1/org/eclipse/e4/ui/workbench/addons/swt/1.2.0/swt-1.2.0.jar
[DEBUG]  /home/jenkins/jenkins-slave/maven-repositories/1/org/eclipse/e4/ui/workbench/renderers/swt/0.13.0/swt-0.13.0.jar
[DEBUG]  /home/jenkins/jenkins-slave/maven-repositories/1/org/eclipse/e4/ui/services/1.2.0/services-1.2.0.jar
[DEBUG]  /home/jenkins/jenkins-slave/maven-repositories/1/org/eclipse/equinox/preferences/3.5.300/preferences-3.5.300.jar
[DEBUG]  /home/jenkins/jenkins-slave/maven-repositories/1/org/eclipse/equinox/app/1.3.300/app-1.3.300.jar
[DEBUG]  /home/jenkins/jenkins-slave/maven-repositories/1/org/eclipse/emf/ecore/xmi/2.11.1/xmi-2.11.1.jar
[DEBUG]  /home/jenkins/jenkins-slave/maven-repositories/1/org/eclipse/emf/ecore/2.11.1/ecore-2.11.1.jar
[DEBUG]  /home/jenkins/jenkins-slave/maven-repositories/1/org/apache/uima/ruta-core/2.4.1-SNAPSHOT/ruta-core-2.4.1-SNAPSHOT.jar
[DEBUG]  /home/jenkins/jenkins-slave/maven-repositories/1/org/apache/uima/uimaj-core/2.8.1/uimaj-core-2.8.1.jar
[DEBUG]  /home/jenkins/jenkins-slave/maven-repositories/1/org/antlr/antlr-runtime/3.5.2/antlr-runtime-3.5.2.jar
[DEBUG]  /home/jenkins/jenkins-slave/maven-repositories/1/org/htmlparser/htmlparser/1.6/htmlparser-1.6.jar
[DEBUG]  /home/jenkins/jenkins-slave/maven-repositories/1/commons-collections/commons-collections/3.2.1/commons-collections-3.2.1.jar
[DEBUG]  /home/jenkins/jenkins-slave/maven-repositories/1/org/apache/uima/uimaj-tools/2.8.1/uimaj-tools-2.8.1.jar
[DEBUG]  /home/jenkins/jenkins-slave/maven-repositories/1/org/apache/uima/uimaj-cpe/2.8.1/uimaj-cpe-2.8.1.jar
[DEBUG]  /home/jenkins/jenkins-slave/maven-repositories/1/org/apache/uima/uimaj-adapter-vinci/2.8.1/uimaj-adapter-vinci-2.8.1.jar
[DEBUG]  /home/jenkins/jenkins-slave/maven-repositories/1/org/apache/uima/jVinci/2.8.1/jVinci-2.8.1.jar
[DEBUG]  /home/jenkins/jenkins-slave/maven-repositories/1/org/apache/uima/uimafit-core/2.1.0/uimafit-core-2.1.0.jar
[DEBUG]  /home/jenkins/jenkins-slave/maven-repositories/1/commons-lang/commons-lang/2.6/commons-lang-2.6.jar
[DEBUG]  /home/jenkins/jenkins-slave/maven-repositories/1/commons-logging/commons-logging-api/1.1/commons-logging-api-1.1.jar
[DEBUG]  /home/jenkins/jenkins-slave/maven-repositories/1/org/springframework/spring-core/3.1.2.RELEASE/spring-core-3.1.2.RELEASE.jar
[DEBUG]  /home/jenkins/jenkins-slave/maven-repositories/1/org/springframework/spring-asm/3.1.2.RELEASE/spring-asm-3.1.2.RELEASE.jar
[DEBUG]  /home/jenkins/jenkins-slave/maven-repositories/1/commons-logging/commons-logging/1.1.1/commons-logging-1.1.1.jar
[DEBUG]  /home/jenkins/jenkins-slave/maven-repositories/1/org/springframework/spring-context/3.1.2.RELEASE/spring-context-3.1.2.RELEASE.jar
[DEBUG]  /home/jenkins/jenkins-slave/maven-repositories/1/org/springframework/spring-expression/3.1.2.RELEASE/spring-expression-3.1.2.RELEASE.jar
[DEBUG]  /home/jenkins/jenkins-slave/maven-repositories/1/org/springframework/spring-beans/3.1.2.RELEASE/spring-beans-3.1.2.RELEASE.jar
[DEBUG]  /home/jenkins/jenkins-slave/maven-repositories/1/commons-io/commons-io/2.4/commons-io-2.4.jar
[DEBUG]  /home/jenkins/jenkins-slave/maven-repositories/1/org/apache/commons/commons-math3/3.0/commons-math3-3.0.jar
[DEBUG]  /home/jenkins/jenkins-slave/maven-repositories/1/org/eclipse/jdt/launching/3.8.0/launching-3.8.0.jar
[DEBUG]  /home/jenkins/jenkins-slave/maven-repositories/1/org/eclipse/debug/core/3.10.0/core-3.10.0.jar
[DEBUG]  /home/jenkins/jenkins-slave/maven-repositories/1/org/eclipse/jdt/debug/3.9.0/debug-3.9.0.jar
[DEBUG]  /home/jenkins/jenkins-slave/maven-repositories/1/org/eclipse/core/variables/3.2.800/variables-3.2.800.jar
[DEBUG]  /home/jenkins/jenkins-slave/maven-repositories/1/org/eclipse/jdt/core/3.11.1/core-3.11.1.jar
[DEBUG]  /home/jenkins/jenkins-slave/maven-repositories/1/org/eclipse/text/3.5.400/text-3.5.400.jar
[DEBUG]  /home/jenkins/jenkins-slave/maven-repositories/1/org/apache/commons/commons-lang3/3.1/commons-lang3-3.1.jar
[DEBUG]  /home/jenkins/jenkins-slave/maven-repositories/1/org/eclipse/dltk/core/5.3.0/core-5.3.0.jar
[DEBUG]  /home/jenkins/jenkins-slave/maven-repositories/1/org/eclipse/dltk/ui/5.3.0/ui-5.3.0.jar
[DEBUG]  /home/jenkins/jenkins-slave/maven-repositories/1/org/eclipse/ui/workbench/texteditor/3.9.100/texteditor-3.9.100.jar
[DEBUG]  /home/jenkins/jenkins-slave/maven-repositories/1/org/eclipse/compare/core/3.5.500/core-3.5.500.jar
[DEBUG]  /home/jenkins/jenkins-slave/maven-repositories/1/org/eclipse/jface/text/3.10.0/text-3.10.0.jar
[DEBUG]  /home/jenkins/jenkins-slave/maven-repositories/1/org/eclipse/ui/editors/3.9.0/editors-3.9.0.jar
[DEBUG]  /home/jenkins/jenkins-slave/maven-repositories/1/org/eclipse/core/filebuffers/3.5.500/filebuffers-3.5.500.jar
[DEBUG]  /home/jenkins/jenkins-slave/maven-repositories/1/org/eclipse/ui/ide/3.11.0/ide-3.11.0.jar
[DEBUG]  /home/jenkins/jenkins-slave/maven-repositories/1/org/eclipse/e4/core/contexts/1.4.0/contexts-1.4.0.jar
[DEBUG]  /home/jenkins/jenkins-slave/maven-repositories/1/org/eclipse/ui/views/3.8.0/views-3.8.0.jar
[DEBUG]  /home/jenkins/jenkins-slave/maven-repositories/1/org/eclipse/ui/forms/3.6.200/forms-3.6.200.jar
[DEBUG]  /home/jenkins/jenkins-slave/maven-repositories/1/org/eclipse/ui/navigator/3.6.0/navigator-3.6.0.jar
[DEBUG]  /home/jenkins/jenkins-slave/maven-repositories/1/org/eclipse/team/core/3.7.100/core-3.7.100.jar
[DEBUG]  /home/jenkins/jenkins-slave/maven-repositories/1/org/eclipse/ltk/core/refactoring/3.6.201/refactoring-3.6.201.jar
[DEBUG]  /home/jenkins/jenkins-slave/maven-repositories/1/org/eclipse/ltk/ui/refactoring/3.7.200/refactoring-3.7.200.jar
[DEBUG]  /home/jenkins/jenkins-slave/maven-repositories/1/org/eclipse/team/ui/3.7.200/ui-3.7.200.jar
[DEBUG]  /home/jenkins/jenkins-slave/maven-repositories/1/org/eclipse/search/3.10.0/search-3.10.0.jar
[DEBUG]  /home/jenkins/jenkins-slave/maven-repositories/1/org/eclipse/compare/3.5.600/compare-3.5.600.jar
[DEBUG]  /home/jenkins/jenkins-slave/maven-repositories/1/com/ibm/icu/54.1.1/icu-54.1.1.jar
[DEBUG]  /home/jenkins/jenkins-slave/maven-repositories/1/org/eclipse/dltk/debug/5.3.0/debug-5.3.0.jar
[DEBUG]  /home/jenkins/jenkins-slave/maven-repositories/1/org/eclipse/dltk/annotations/5.3.0/annotations-5.3.0.jar
[DEBUG]  /home/jenkins/jenkins-slave/maven-repositories/1/org/eclipse/dltk/launching/5.3.0/launching-5.3.0.jar
[DEBUG]  /home/jenkins/jenkins-slave/maven-repositories/1/org/eclipse/dltk/core/manipulation/5.3.0/manipulation-5.3.0.jar
[DEBUG]  /home/jenkins/jenkins-slave/maven-repositories/1/org/eclipse/dltk/validators/core/5.3.0/core-5.3.0.jar
[DEBUG]  /home/jenkins/jenkins-slave/maven-repositories/1/org/eclipse/dltk/console/5.3.0/console-5.3.0.jar
[DEBUG]  /home/jenkins/jenkins-slave/maven-repositories/1/org/eclipse/swt/win32/win32/x86_64/3.104.1/x86_64-3.104.1.jar
[DEBUG] Source roots:
[DEBUG]  <https://builds.apache.org/job/UIMA-Ruta/org.apache.uima$ruta-ep-ide/ws/src/main/java>
[DEBUG]  <https://builds.apache.org/job/UIMA-Ruta/org.apache.uima$ruta-ep-ide/ws/target/generated-sources/antlr3>
[DEBUG] Command line options:
[DEBUG] -d <https://builds.apache.org/job/UIMA-Ruta/org.apache.uima$ruta-ep-ide/ws/target/classes>
-classpath <https://builds.apache.org/job/UIMA-Ruta/org.apache.uima$ruta-ep-ide/ws/target/classes>:/home/jenkins/jenkins-slave/maven-repositories/1/org/eclipse/core/runtime/3.11.1/runtime-3.11.1.jar:/home/jenkins/jenkins-slave/maven-repositories/1/org/eclipse/osgi/3.10.101/osgi-3.10.101.jar:/home/jenkins/jenkins-slave/maven-repositories/1/org/eclipse/equinox/common/3.7.0/common-3.7.0.jar:/home/jenkins/jenkins-slave/maven-repositories/1/org/eclipse/core/jobs/3.7.0/jobs-3.7.0.jar:/home/jenkins/jenkins-slave/maven-repositories/1/org/eclipse/equinox/registry/3.6.0/registry-3.6.0.jar:/home/jenkins/jenkins-slave/maven-repositories/1/org/eclipse/core/resources/3.10.1/resources-3.10.1.jar:/home/jenkins/jenkins-slave/maven-repositories/1/org/eclipse/core/expressions/3.5.0/expressions-3.5.0.jar:/home/jenkins/jenkins-slave/maven-repositories/1/org/eclipse/core/filesystem/1.5.0/filesystem-1.5.0.jar:/home/jenkins/jenkins-slave/maven-repositories/1/org/eclipse/ui/3.107.0/ui-3.107.0.jar:/home/jenkins/jenkins-slave/maven-repositories/1/org/eclipse/swt/3.104.1/swt-3.104.1.jar:/home/jenkins/jenkins-slave/maven-repositories/1/org/eclipse/jface/3.11.0/jface-3.11.0.jar:/home/jenkins/jenkins-slave/maven-repositories/1/org/eclipse/core/commands/3.7.0/commands-3.7.0.jar:/home/jenkins/jenkins-slave/maven-repositories/1/org/eclipse/ui/workbench/3.107.0/workbench-3.107.0.jar:/home/jenkins/jenkins-slave/maven-repositories/1/org/eclipse/help/3.6.0/help-3.6.0.jar:/home/jenkins/jenkins-slave/maven-repositories/1/org/eclipse/jface/databinding/1.7.0/databinding-1.7.0.jar:/home/jenkins/jenkins-slave/maven-repositories/1/org/eclipse/core/databinding/1.5.0/databinding-1.5.0.jar:/home/jenkins/jenkins-slave/maven-repositories/1/org/eclipse/core/databinding/property/1.5.0/property-1.5.0.jar:/home/jenkins/jenkins-slave/maven-repositories/1/org/eclipse/core/databinding/observable/1.5.0/observable-1.5.0.jar:/home/jenkins/jenkins-slave/maven-repositories/1/org/eclipse/e4/core/services/2.0.0/services-2.0.0.jar:/home/jenkins/jenkins-slave/maven-repositories/1/org/eclipse/e4/core/di/1.5.0/di-1.5.0.jar:/home/jenkins/jenkins-slave/maven-repositories/1/org/eclipse/e4/ui/workbench/swt/0.13.0/swt-0.13.0.jar:/home/jenkins/jenkins-slave/maven-repositories/1/org/w3c/css/sac/1.3.1/sac-1.3.1.jar:/home/jenkins/jenkins-slave/maven-repositories/1/org/eclipse/osgi/services/3.5.0/services-3.5.0.jar:/home/jenkins/jenkins-slave/maven-repositories/1/org/eclipse/e4/core/commands/0.11.0/commands-0.11.0.jar:/home/jenkins/jenkins-slave/maven-repositories/1/org/eclipse/e4/ui/widgets/1.1.0/widgets-1.1.0.jar:/home/jenkins/jenkins-slave/maven-repositories/1/org/eclipse/e4/core/di/extensions/0.13.0/extensions-0.13.0.jar:/home/jenkins/jenkins-slave/maven-repositories/1/org/eclipse/e4/ui/di/1.1.0/di-1.1.0.jar:/home/jenkins/jenkins-slave/maven-repositories/1/org/eclipse/e4/ui/model/workbench/1.1.100/workbench-1.1.100.jar:/home/jenkins/jenkins-slave/maven-repositories/1/org/eclipse/e4/ui/css/swt/theme/0.10.0/theme-0.10.0.jar:/home/jenkins/jenkins-slave/maven-repositories/1/org/eclipse/e4/ui/bindings/0.11.0/bindings-0.11.0.jar:/home/jenkins/jenkins-slave/maven-repositories/1/org/eclipse/e4/ui/css/swt/0.12.0/swt-0.12.0.jar:/home/jenkins/jenkins-slave/maven-repositories/1/org/eclipse/e4/ui/css/core/0.11.0/core-0.11.0.jar:/home/jenkins/jenkins-slave/maven-repositories/1/org/eclipse/e4/ui/workbench3/0.13.0/workbench3-0.13.0.jar:/home/jenkins/jenkins-slave/maven-repositories/1/org/eclipse/e4/ui/workbench/addons/swt/1.2.0/swt-1.2.0.jar:/home/jenkins/jenkins-slave/maven-repositories/1/org/eclipse/e4/ui/workbench/renderers/swt/0.13.0/swt-0.13.0.jar:/home/jenkins/jenkins-slave/maven-repositories/1/org/eclipse/e4/ui/services/1.2.0/services-1.2.0.jar:/home/jenkins/jenkins-slave/maven-repositories/1/org/eclipse/equinox/preferences/3.5.300/preferences-3.5.300.jar:/home/jenkins/jenkins-slave/maven-repositories/1/org/eclipse/equinox/app/1.3.300/app-1.3.300.jar:/home/jenkins/jenkins-slave/maven-repositories/1/org/eclipse/emf/ecore/xmi/2.11.1/xmi-2.11.1.jar:/home/jenkins/jenkins-slave/maven-repositories/1/org/eclipse/emf/ecore/2.11.1/ecore-2.11.1.jar:/home/jenkins/jenkins-slave/maven-repositories/1/org/apache/uima/ruta-core/2.4.1-SNAPSHOT/ruta-core-2.4.1-SNAPSHOT.jar:/home/jenkins/jenkins-slave/maven-repositories/1/org/apache/uima/uimaj-core/2.8.1/uimaj-core-2.8.1.jar:/home/jenkins/jenkins-slave/maven-repositories/1/org/antlr/antlr-runtime/3.5.2/antlr-runtime-3.5.2.jar:/home/jenkins/jenkins-slave/maven-repositories/1/org/htmlparser/htmlparser/1.6/htmlparser-1.6.jar:/home/jenkins/jenkins-slave/maven-repositories/1/commons-collections/commons-collections/3.2.1/commons-collections-3.2.1.jar:/home/jenkins/jenkins-slave/maven-repositories/1/org/apache/uima/uimaj-tools/2.8.1/uimaj-tools-2.8.1.jar:/home/jenkins/jenkins-slave/maven-repositories/1/org/apache/uima/uimaj-cpe/2.8.1/uimaj-cpe-2.8.1.jar:/home/jenkins/jenkins-slave/maven-repositories/1/org/apache/uima/uimaj-adapter-vinci/2.8.1/uimaj-adapter-vinci-2.8.1.jar:/home/jenkins/jenkins-slave/maven-repositories/1/org/apache/uima/jVinci/2.8.1/jVinci-2.8.1.jar:/home/jenkins/jenkins-slave/maven-repositories/1/org/apache/uima/uimafit-core/2.1.0/uimafit-core-2.1.0.jar:/home/jenkins/jenkins-slave/maven-repositories/1/commons-lang/commons-lang/2.6/commons-lang-2.6.jar:/home/jenkins/jenkins-slave/maven-repositories/1/commons-logging/commons-logging-api/1.1/commons-logging-api-1.1.jar:/home/jenkins/jenkins-slave/maven-repositories/1/org/springframework/spring-core/3.1.2.RELEASE/spring-core-3.1.2.RELEASE.jar:/home/jenkins/jenkins-slave/maven-repositories/1/org/springframework/spring-asm/3.1.2.RELEASE/spring-asm-3.1.2.RELEASE.jar:/home/jenkins/jenkins-slave/maven-repositories/1/commons-logging/commons-logging/1.1.1/commons-logging-1.1.1.jar:/home/jenkins/jenkins-slave/maven-repositories/1/org/springframework/spring-context/3.1.2.RELEASE/spring-context-3.1.2.RELEASE.jar:/home/jenkins/jenkins-slave/maven-repositories/1/org/springframework/spring-expression/3.1.2.RELEASE/spring-expression-3.1.2.RELEASE.jar:/home/jenkins/jenkins-slave/maven-repositories/1/org/springframework/spring-beans/3.1.2.RELEASE/spring-beans-3.1.2.RELEASE.jar:/home/jenkins/jenkins-slave/maven-repositories/1/commons-io/commons-io/2.4/commons-io-2.4.jar:/home/jenkins/jenkins-slave/maven-repositories/1/org/apache/commons/commons-math3/3.0/commons-math3-3.0.jar:/home/jenkins/jenkins-slave/maven-repositories/1/org/eclipse/jdt/launching/3.8.0/launching-3.8.0.jar:/home/jenkins/jenkins-slave/maven-repositories/1/org/eclipse/debug/core/3.10.0/core-3.10.0.jar:/home/jenkins/jenkins-slave/maven-repositories/1/org/eclipse/jdt/debug/3.9.0/debug-3.9.0.jar:/home/jenkins/jenkins-slave/maven-repositories/1/org/eclipse/core/variables/3.2.800/variables-3.2.800.jar:/home/jenkins/jenkins-slave/maven-repositories/1/org/eclipse/jdt/core/3.11.1/core-3.11.1.jar:/home/jenkins/jenkins-slave/maven-repositories/1/org/eclipse/text/3.5.400/text-3.5.400.jar:/home/jenkins/jenkins-slave/maven-repositories/1/org/apache/commons/commons-lang3/3.1/commons-lang3-3.1.jar:/home/jenkins/jenkins-slave/maven-repositories/1/org/eclipse/dltk/core/5.3.0/core-5.3.0.jar:/home/jenkins/jenkins-slave/maven-repositories/1/org/eclipse/dltk/ui/5.3.0/ui-5.3.0.jar:/home/jenkins/jenkins-slave/maven-repositories/1/org/eclipse/ui/workbench/texteditor/3.9.100/texteditor-3.9.100.jar:/home/jenkins/jenkins-slave/maven-repositories/1/org/eclipse/compare/core/3.5.500/core-3.5.500.jar:/home/jenkins/jenkins-slave/maven-repositories/1/org/eclipse/jface/text/3.10.0/text-3.10.0.jar:/home/jenkins/jenkins-slave/maven-repositories/1/org/eclipse/ui/editors/3.9.0/editors-3.9.0.jar:/home/jenkins/jenkins-slave/maven-repositories/1/org/eclipse/core/filebuffers/3.5.500/filebuffers-3.5.500.jar:/home/jenkins/jenkins-slave/maven-repositories/1/org/eclipse/ui/ide/3.11.0/ide-3.11.0.jar:/home/jenkins/jenkins-slave/maven-repositories/1/org/eclipse/e4/core/contexts/1.4.0/contexts-1.4.0.jar:/home/jenkins/jenkins-slave/maven-repositories/1/org/eclipse/ui/views/3.8.0/views-3.8.0.jar:/home/jenkins/jenkins-slave/maven-repositories/1/org/eclipse/ui/forms/3.6.200/forms-3.6.200.jar:/home/jenkins/jenkins-slave/maven-repositories/1/org/eclipse/ui/navigator/3.6.0/navigator-3.6.0.jar:/home/jenkins/jenkins-slave/maven-repositories/1/org/eclipse/team/core/3.7.100/core-3.7.100.jar:/home/jenkins/jenkins-slave/maven-repositories/1/org/eclipse/ltk/core/refactoring/3.6.201/refactoring-3.6.201.jar:/home/jenkins/jenkins-slave/maven-repositories/1/org/eclipse/ltk/ui/refactoring/3.7.200/refactoring-3.7.200.jar:/home/jenkins/jenkins-slave/maven-repositories/1/org/eclipse/team/ui/3.7.200/ui-3.7.200.jar:/home/jenkins/jenkins-slave/maven-repositories/1/org/eclipse/search/3.10.0/search-3.10.0.jar:/home/jenkins/jenkins-slave/maven-repositories/1/org/eclipse/compare/3.5.600/compare-3.5.600.jar:/home/jenkins/jenkins-slave/maven-repositories/1/com/ibm/icu/54.1.1/icu-54.1.1.jar:/home/jenkins/jenkins-slave/maven-repositories/1/org/eclipse/dltk/debug/5.3.0/debug-5.3.0.jar:/home/jenkins/jenkins-slave/maven-repositories/1/org/eclipse/dltk/annotations/5.3.0/annotations-5.3.0.jar:/home/jenkins/jenkins-slave/maven-repositories/1/org/eclipse/dltk/launching/5.3.0/launching-5.3.0.jar:/home/jenkins/jenkins-slave/maven-repositories/1/org/eclipse/dltk/core/manipulation/5.3.0/manipulation-5.3.0.jar:/home/jenkins/jenkins-slave/maven-repositories/1/org/eclipse/dltk/validators/core/5.3.0/core-5.3.0.jar:/home/jenkins/jenkins-slave/maven-repositories/1/org/eclipse/dltk/console/5.3.0/console-5.3.0.jar:/home/jenkins/jenkins-slave/maven-repositories/1/org/eclipse/swt/win32/win32/x86_64/3.104.1/x86_64-3.104.1.jar:
-sourcepath <https://builds.apache.org/job/UIMA-Ruta/org.apache.uima$ruta-ep-ide/ws/src/main/java>:<https://builds.apache.org/job/UIMA-Ruta/org.apache.uima$ruta-ep-ide/ws/target/generated-sources/antlr3>:
-s <https://builds.apache.org/job/UIMA-Ruta/org.apache.uima$ruta-ep-ide/ws/target/generated-sources/annotations>
-g -nowarn -target 1.7 -source 1.7 -encoding UTF-8
[DEBUG] incrementalBuildHelper#beforeRebuildExecution
[INFO] Compiling 129 source files to <https://builds.apache.org/job/UIMA-Ruta/org.apache.uima$ruta-ep-ide/ws/target/classes>
[DEBUG] incrementalBuildHelper#afterRebuildExecution
[INFO] -------------------------------------------------------------
[WARNING] COMPILATION WARNING : 
[INFO] -------------------------------------------------------------
[WARNING] <https://builds.apache.org/job/UIMA-Ruta/org.apache.uima$ruta-ep-ide/ws/src/main/java/org/apache/uima/ruta/ide/core/parser/DLTKTokenConverter.java>:
Some input files use or override a deprecated API.
[WARNING] <https://builds.apache.org/job/UIMA-Ruta/org.apache.uima$ruta-ep-ide/ws/src/main/java/org/apache/uima/ruta/ide/core/parser/DLTKTokenConverter.java>:
Recompile with -Xlint:deprecation for details.
[WARNING] <https://builds.apache.org/job/UIMA-Ruta/org.apache.uima$ruta-ep-ide/ws/src/main/java/org/apache/uima/ruta/ide/core/codeassist/RutaSelectionEngine.java>:
Some input files use unchecked or unsafe operations.
[WARNING] <https://builds.apache.org/job/UIMA-Ruta/org.apache.uima$ruta-ep-ide/ws/src/main/java/org/apache/uima/ruta/ide/core/codeassist/RutaSelectionEngine.java>:
Recompile with -Xlint:unchecked for details.
[INFO] 4 warnings 
[INFO] -------------------------------------------------------------
[INFO] -------------------------------------------------------------
[ERROR] COMPILATION ERROR : 
[INFO] -------------------------------------------------------------
[ERROR] <https://builds.apache.org/job/UIMA-Ruta/org.apache.uima$ruta-ep-ide/ws/src/main/java/org/apache/uima/ruta/ide/core/RutaContentDescriber.java>:[26,8]
cannot access org.eclipse.core.runtime.content.ITextContentDescriber
  class file for org.eclipse.core.runtime.content.ITextContentDescriber not found
[ERROR] <https://builds.apache.org/job/UIMA-Ruta/org.apache.uima$ruta-ep-ide/ws/src/main/java/org/apache/uima/ruta/ide/core/RutaContentDescriber.java>:[29,3]
method does not override or implement a method from a supertype
[INFO] 2 errors 
[INFO] -------------------------------------------------------------
[INFO] ------------------------------------------------------------------------
[INFO] BUILD FAILURE
[INFO] ------------------------------------------------------------------------
[INFO] Total time: 9:34.767s
[INFO] Finished at: Wed Mar 02 16:26:18 UTC 2016
[INFO] Final Memory: 39M/659M
[INFO] ------------------------------------------------------------------------
Waiting for Jenkins to finish collecting data
[ERROR] Failed to execute goal org.apache.maven.plugins:maven-compiler-plugin:3.1:compile
(default-compile) on project ruta-ep-ide: Compilation failure: Compilation failure:
[ERROR] <https://builds.apache.org/job/UIMA-Ruta/org.apache.uima$ruta-ep-ide/ws/src/main/java/org/apache/uima/ruta/ide/core/RutaContentDescriber.java>:[26,8]
cannot access org.eclipse.core.runtime.content.ITextContentDescriber
[ERROR] class file for org.eclipse.core.runtime.content.ITextContentDescriber not found
[ERROR] <https://builds.apache.org/job/UIMA-Ruta/org.apache.uima$ruta-ep-ide/ws/src/main/java/org/apache/uima/ruta/ide/core/RutaContentDescriber.java>:[29,3]
method does not override or implement a method from a supertype
[ERROR] -> [Help 1]
org.apache.maven.lifecycle.LifecycleExecutionException: Failed to execute goal org.apache.maven.plugins:maven-compiler-plugin:3.1:compile
(default-compile) on project ruta-ep-ide: Compilation failure
	at org.apache.maven.lifecycle.internal.MojoExecutor.execute(MojoExecutor.java:213)
	at org.apache.maven.lifecycle.internal.MojoExecutor.execute(MojoExecutor.java:153)
	at org.apache.maven.lifecycle.internal.MojoExecutor.execute(MojoExecutor.java:145)
	at org.apache.maven.lifecycle.internal.LifecycleModuleBuilder.buildProject(LifecycleModuleBuilder.java:84)
	at org.apache.maven.lifecycle.internal.LifecycleModuleBuilder.buildProject(LifecycleModuleBuilder.java:59)
	at org.apache.maven.lifecycle.internal.LifecycleStarter.singleThreadedBuild(LifecycleStarter.java:183)
	at org.apache.maven.lifecycle.internal.LifecycleStarter.execute(LifecycleStarter.java:161)
	at org.apache.maven.DefaultMaven.doExecute(DefaultMaven.java:319)
	at org.apache.maven.DefaultMaven.execute(DefaultMaven.java:156)
	at org.jvnet.hudson.maven3.launcher.Maven3Launcher.main(Maven3Launcher.java:117)
	at sun.reflect.NativeMethodAccessorImpl.invoke0(Native Method)
	at sun.reflect.NativeMethodAccessorImpl.invoke(NativeMethodAccessorImpl.java:57)
	at sun.reflect.DelegatingMethodAccessorImpl.invoke(DelegatingMethodAccessorImpl.java:43)
	at java.lang.reflect.Method.invoke(Method.java:606)
	at org.codehaus.plexus.classworlds.launcher.Launcher.launchStandard(Launcher.java:329)
	at org.codehaus.plexus.classworlds.launcher.Launcher.launch(Launcher.java:239)
	at org.jvnet.hudson.maven3.agent.Maven3Main.launch(Maven3Main.java:181)
	at sun.reflect.NativeMethodAccessorImpl.invoke0(Native Method)
	at sun.reflect.NativeMethodAccessorImpl.invoke(NativeMethodAccessorImpl.java:57)
	at sun.reflect.DelegatingMethodAccessorImpl.invoke(DelegatingMethodAccessorImpl.java:43)
	at java.lang.reflect.Method.invoke(Method.java:606)
	at hudson.maven.Maven3Builder.call(Maven3Builder.java:136)
	at hudson.maven.Maven3Builder.call(Maven3Builder.java:71)
	at hudson.remoting.UserRequest.perform(UserRequest.java:120)
	at hudson.remoting.UserRequest.perform(UserRequest.java:48)
	at hudson.remoting.Request$2.run(Request.java:326)
	at hudson.remoting.InterceptingExecutorService$1.call(InterceptingExecutorService.java:68)
	at java.util.concurrent.FutureTask.run(FutureTask.java:262)
	at java.util.concurrent.ThreadPoolExecutor.runWorker(ThreadPoolExecutor.java:1145)
	at java.util.concurrent.ThreadPoolExecutor$Worker.run(ThreadPoolExecutor.java:615)
	at java.lang.Thread.run(Thread.java:745)
Caused by: org.apache.maven.plugin.compiler.CompilationFailureException: Compilation failure
	at org.apache.maven.plugin.compiler.AbstractCompilerMojo.execute(AbstractCompilerMojo.java:858)
	at org.apache.maven.plugin.compiler.CompilerMojo.execute(CompilerMojo.java:129)
	at org.apache.maven.plugin.DefaultBuildPluginManager.executeMojo(DefaultBuildPluginManager.java:101)
	at org.apache.maven.lifecycle.internal.MojoExecutor.execute(MojoExecutor.java:209)
	... 30 more
[ERROR] 
[ERROR] Re-run Maven using the -X switch to enable full debug logging.
[ERROR] 
[ERROR] For more information about the errors and possible solutions, please read the following
articles:
[ERROR] [Help 1] http://cwiki.apache.org/confluence/display/MAVEN/MojoFailureException
Sending e-mails to: dev@uima.apache.org
lugin.compiler.CompilerMojo.execute(CompilerMojo.java:129)
	at org.apache.maven.plugin.DefaultBuildPluginManager.executeMojo(DefaultBuildPluginManager.java:101)
	at org.apache.maven.lifecycle.internal.MojoExecutor.execute(MojoExecutor.java:209)
	... 30 more
[ERROR] 
[ERROR] Re-run Maven using the -X switch to enable full debug logging.
[ERROR] 
[ERROR] For more information about the errors and possible solutions, please read the following
articles:
[ERROR] [Help 1] http://cwiki.apache.org/confluence/display/MAVEN/MojoFailureException
[JENKINS] Archiving <https://builds.apache.org/job/UIMA-Ruta/org.apache.uima$ruta-ep-ide/ws/pom.xml>
to org.apache.uima/ruta-ep-ide/2.4.1-SNAPSHOT/ruta-ep-ide-2.4.1-SNAPSHOT.pom
Sending e-mails to: dev@uima.apache.org

Mime
View raw message