uima-dev mailing list archives

Site index · List index
Message view « Date » · « Thread »
Top « Date » · « Thread »
From Apache Jenkins Server <jenk...@builds.apache.org>
Subject Build failed in Jenkins: UIMA-Ruta #918
Date Mon, 10 Jul 2017 11:51:58 GMT
See <https://builds.apache.org/job/UIMA-Ruta/918/display/redirect?page=changes>

Changes:

[pkluegl] UIMA-5456
- added test

------------------------------------------
[...truncated 2.27 MB...]
[INFO] --- maven-clean-plugin:2.5:clean (default-clean) @ ruta-maven-plugin ---
[TASKS] Scanning folder '<https://builds.apache.org/job/UIMA-Ruta/ws/trunk/ruta-maven-plugin'>
for files matching the pattern '**/*.java' - excludes: 
[TASKS] Found 9 files to scan for tasks
Found 1 open tasks.
[TASKS] Computing warning deltas based on reference build #915
[INFO] 
[INFO] --- maven-enforcer-plugin:1.3.1:enforce (enforce-versions) @ ruta-maven-plugin ---
[INFO] 
[INFO] --- build-helper-maven-plugin:1.8:parse-version (parse-project-version) @ ruta-maven-plugin
---
[INFO] 
[INFO] --- uima-build-helper-maven-plugin:7:parse-date-time (set buildYear and buildMonth)
@ ruta-maven-plugin ---
[INFO] 
[INFO] --- maven-plugin-plugin:3.3:helpmojo (generate-helpmojo) @ ruta-maven-plugin ---
[INFO] Using 'UTF-8' encoding to read mojo metadata.
[INFO] Applying mojo extractor for language: java-annotations
[INFO] Mojo extractor for language: java-annotations found 0 mojo descriptors.
[INFO] 
[INFO] --- maven-remote-resources-plugin:1.5:process (default) @ ruta-maven-plugin ---
[INFO] 
[INFO] --- maven-resources-plugin:2.6:resources (default-resources) @ ruta-maven-plugin ---
[INFO] Using 'UTF-8' encoding to copy filtered resources.
[INFO] Copying 1 resource
[INFO] Copying 3 resources
[INFO] 
[INFO] --- maven-compiler-plugin:3.1:compile (default-compile) @ ruta-maven-plugin ---
[INFO] Changes detected - recompiling the module!
[INFO] Compiling 5 source files to <https://builds.apache.org/job/UIMA-Ruta/ws/trunk/ruta-maven-plugin/target/classes>
[INFO] 
[INFO] --- maven-plugin-plugin:3.3:descriptor (default-descriptor) @ ruta-maven-plugin ---
[INFO] Using 'UTF-8' encoding to read mojo metadata.
[INFO] Applying mojo extractor for language: java-annotations
[INFO] Mojo extractor for language: java-annotations found 4 mojo descriptors.
[INFO] 
[INFO] --- maven-resources-plugin:2.6:testResources (default-testResources) @ ruta-maven-plugin
---
[INFO] Using 'UTF-8' encoding to copy filtered resources.
[INFO] Copying 2 resources
[INFO] Copying 3 resources
[INFO] 
[INFO] --- maven-compiler-plugin:3.1:testCompile (default-testCompile) @ ruta-maven-plugin
---
[INFO] Changes detected - recompiling the module!
[INFO] Compiling 1 source file to <https://builds.apache.org/job/UIMA-Ruta/ws/trunk/ruta-maven-plugin/target/test-classes>
[INFO] 
[INFO] --- maven-surefire-plugin:2.16:test (default-test) @ ruta-maven-plugin ---
[INFO] Surefire report directory: <https://builds.apache.org/job/UIMA-Ruta/ws/trunk/ruta-maven-plugin/target/surefire-reports>

-------------------------------------------------------
 T E S T S
-------------------------------------------------------
Running org.apache.uima.ruta.maven.RutaGenerateDescriptorMojoTest
[debug] Classpath entry: <https://builds.apache.org/job/UIMA-Ruta/ws/trunk/ruta-maven-plugin/target/project-simple-test/src/main/java>
[debug] Classpath entry: <https://builds.apache.org/job/UIMA-Ruta/ws/trunk/ruta-maven-plugin/target/project-simple-test/target/generated-sources/ruta/descriptor>
[debug] Classpath entry: <https://builds.apache.org/job/UIMA-Ruta/ws/trunk/ruta-maven-plugin/target/project-simple-test/src/main/resources>
[debug] Classpath entry: <https://builds.apache.org/job/UIMA-Ruta/ws/trunk/ruta-maven-plugin/target/project-simple-test/target/classes>
[debug] Writing descriptor to: <https://builds.apache.org/job/UIMA-Ruta/ws/trunk/ruta-maven-plugin/target/project-simple-test/target/generated-sources/ruta/descriptor/SimpleEngine.xml>
[debug] Writing descriptor to: <https://builds.apache.org/job/UIMA-Ruta/ws/trunk/ruta-maven-plugin/target/project-simple-test/target/generated-sources/ruta/descriptor/SimpleTypeSystem.xml>
Tests run: 1, Failures: 0, Errors: 0, Skipped: 0, Time elapsed: 3.691 sec - in org.apache.uima.ruta.maven.RutaGenerateDescriptorMojoTest

Results :

Tests run: 1, Failures: 0, Errors: 0, Skipped: 0

[JENKINS] Recording test results
[INFO] 
[INFO] --- maven-antrun-plugin:1.7:run (dup-meta-jar-cleanup) @ ruta-maven-plugin ---
[INFO] Executing tasks

main:
[INFO] Executed tasks
[INFO] 
[INFO] --- maven-resources-plugin:2.6:copy-resources (copy customized bin LICENSE file) @
ruta-maven-plugin ---
[INFO] Using 'UTF-8' encoding to copy filtered resources.
[INFO] skip non existing resourceDirectory <https://builds.apache.org/job/UIMA-Ruta/ws/trunk/ruta-maven-plugin/src/main/readme_bin>
[INFO] 
[INFO] --- maven-jar-plugin:2.3.2:jar (default-jar) @ ruta-maven-plugin ---
[INFO] Building jar: <https://builds.apache.org/job/UIMA-Ruta/ws/trunk/ruta-maven-plugin/target/ruta-maven-plugin-2.6.1-SNAPSHOT.jar>
[INFO] 
[INFO] --- maven-plugin-plugin:3.3:addPluginArtifactMetadata (default-addPluginArtifactMetadata)
@ ruta-maven-plugin ---
[INFO] 
[INFO] --- maven-site-plugin:3.3:attach-descriptor (attach-descriptor) @ ruta-maven-plugin
---
[INFO] 
[INFO] --- maven-invoker-plugin:2.0.0:install (integration-test) @ ruta-maven-plugin ---
[INFO] Installing <https://builds.apache.org/job/UIMA-Ruta/ws/trunk/ruta-parent/pom.xml>
to <https://builds.apache.org/job/UIMA-Ruta/ws/trunk/ruta-maven-plugin/target/local-repo/org/apache/uima/ruta-parent/2.6.1-SNAPSHOT/ruta-parent-2.6.1-SNAPSHOT.pom>
[INFO] Installing <https://builds.apache.org/job/UIMA-Ruta/ws/trunk/ruta-basic-type/pom.xml>
to <https://builds.apache.org/job/UIMA-Ruta/ws/trunk/ruta-maven-plugin/target/local-repo/org/apache/uima/ruta-basic-type/2.6.1-SNAPSHOT/ruta-basic-type-2.6.1-SNAPSHOT.pom>
[INFO] Installing <https://builds.apache.org/job/UIMA-Ruta/ws/trunk/ruta-basic-type/target/ruta-basic-type-2.6.1-SNAPSHOT.jar>
to <https://builds.apache.org/job/UIMA-Ruta/ws/trunk/ruta-maven-plugin/target/local-repo/org/apache/uima/ruta-basic-type/2.6.1-SNAPSHOT/ruta-basic-type-2.6.1-SNAPSHOT.jar>
[INFO] Installing <https://builds.apache.org/job/UIMA-Ruta/ws/trunk/ruta-basic-type/pom.xml>
to <https://builds.apache.org/job/UIMA-Ruta/ws/trunk/ruta-maven-plugin/target/local-repo/org/apache/uima/ruta-basic-type/2.6.1-SNAPSHOT/ruta-basic-type-2.6.1-SNAPSHOT.pom>
[INFO] Installing <https://builds.apache.org/job/UIMA-Ruta/ws/trunk/ruta-typesystem/pom.xml>
to <https://builds.apache.org/job/UIMA-Ruta/ws/trunk/ruta-maven-plugin/target/local-repo/org/apache/uima/ruta-typesystem/2.6.1-SNAPSHOT/ruta-typesystem-2.6.1-SNAPSHOT.pom>
[INFO] Installing <https://builds.apache.org/job/UIMA-Ruta/ws/trunk/ruta-typesystem/target/ruta-typesystem-2.6.1-SNAPSHOT.jar>
to <https://builds.apache.org/job/UIMA-Ruta/ws/trunk/ruta-maven-plugin/target/local-repo/org/apache/uima/ruta-typesystem/2.6.1-SNAPSHOT/ruta-typesystem-2.6.1-SNAPSHOT.jar>
[INFO] Installing <https://builds.apache.org/job/UIMA-Ruta/ws/trunk/ruta-typesystem/pom.xml>
to <https://builds.apache.org/job/UIMA-Ruta/ws/trunk/ruta-maven-plugin/target/local-repo/org/apache/uima/ruta-typesystem/2.6.1-SNAPSHOT/ruta-typesystem-2.6.1-SNAPSHOT.pom>
[INFO] Installing <https://builds.apache.org/job/UIMA-Ruta/ws/trunk/ruta-core/pom.xml>
to <https://builds.apache.org/job/UIMA-Ruta/ws/trunk/ruta-maven-plugin/target/local-repo/org/apache/uima/ruta-core/2.6.1-SNAPSHOT/ruta-core-2.6.1-SNAPSHOT.pom>
[INFO] Installing <https://builds.apache.org/job/UIMA-Ruta/ws/trunk/ruta-core/target/ruta-core-2.6.1-SNAPSHOT.jar>
to <https://builds.apache.org/job/UIMA-Ruta/ws/trunk/ruta-maven-plugin/target/local-repo/org/apache/uima/ruta-core/2.6.1-SNAPSHOT/ruta-core-2.6.1-SNAPSHOT.jar>
[INFO] Installing <https://builds.apache.org/job/UIMA-Ruta/ws/trunk/ruta-core/pom.xml>
to <https://builds.apache.org/job/UIMA-Ruta/ws/trunk/ruta-maven-plugin/target/local-repo/org/apache/uima/ruta-core/2.6.1-SNAPSHOT/ruta-core-2.6.1-SNAPSHOT.pom>
[INFO] Installing <https://builds.apache.org/job/UIMA-Ruta/ws/trunk/ruta-core-ext/pom.xml>
to <https://builds.apache.org/job/UIMA-Ruta/ws/trunk/ruta-maven-plugin/target/local-repo/org/apache/uima/ruta-core-ext/2.6.1-SNAPSHOT/ruta-core-ext-2.6.1-SNAPSHOT.pom>
[INFO] Installing <https://builds.apache.org/job/UIMA-Ruta/ws/trunk/ruta-core-ext/target/ruta-core-ext-2.6.1-SNAPSHOT.jar>
to <https://builds.apache.org/job/UIMA-Ruta/ws/trunk/ruta-maven-plugin/target/local-repo/org/apache/uima/ruta-core-ext/2.6.1-SNAPSHOT/ruta-core-ext-2.6.1-SNAPSHOT.jar>
[INFO] Installing <https://builds.apache.org/job/UIMA-Ruta/ws/trunk/ruta-core-ext/pom.xml>
to <https://builds.apache.org/job/UIMA-Ruta/ws/trunk/ruta-maven-plugin/target/local-repo/org/apache/uima/ruta-core-ext/2.6.1-SNAPSHOT/ruta-core-ext-2.6.1-SNAPSHOT.pom>
[INFO] Installing <https://builds.apache.org/job/UIMA-Ruta/ws/trunk/ruta-ep-parent/pom.xml>
to <https://builds.apache.org/job/UIMA-Ruta/ws/trunk/ruta-maven-plugin/target/local-repo/org/apache/uima/ruta-ep-parent/2.6.1-SNAPSHOT/ruta-ep-parent-2.6.1-SNAPSHOT.pom>
[INFO] Installing <https://builds.apache.org/job/UIMA-Ruta/ws/trunk/ruta-ep-engine/pom.xml>
to <https://builds.apache.org/job/UIMA-Ruta/ws/trunk/ruta-maven-plugin/target/local-repo/org/apache/uima/ruta-ep-engine/2.6.1-SNAPSHOT/ruta-ep-engine-2.6.1-SNAPSHOT.pom>
[INFO] Installing <https://builds.apache.org/job/UIMA-Ruta/ws/trunk/ruta-ep-engine/target/org.apache.uima.ruta.engine_2.6.1.SNAPSHOT.jar>
to <https://builds.apache.org/job/UIMA-Ruta/ws/trunk/ruta-maven-plugin/target/local-repo/org/apache/uima/ruta-ep-engine/2.6.1-SNAPSHOT/ruta-ep-engine-2.6.1-SNAPSHOT.jar>
[INFO] Installing <https://builds.apache.org/job/UIMA-Ruta/ws/trunk/ruta-ep-engine/pom.xml>
to <https://builds.apache.org/job/UIMA-Ruta/ws/trunk/ruta-maven-plugin/target/local-repo/org/apache/uima/ruta-ep-engine/2.6.1-SNAPSHOT/ruta-ep-engine-2.6.1-SNAPSHOT.pom>
[INFO] Installing <https://builds.apache.org/job/UIMA-Ruta/ws/trunk/ruta-ep-ide/pom.xml>
to <https://builds.apache.org/job/UIMA-Ruta/ws/trunk/ruta-maven-plugin/target/local-repo/org/apache/uima/ruta-ep-ide/2.6.1-SNAPSHOT/ruta-ep-ide-2.6.1-SNAPSHOT.pom>
[INFO] Installing <https://builds.apache.org/job/UIMA-Ruta/ws/trunk/ruta-ep-ide/target/org.apache.uima.ruta.ide_2.6.1.SNAPSHOT.jar>
to <https://builds.apache.org/job/UIMA-Ruta/ws/trunk/ruta-maven-plugin/target/local-repo/org/apache/uima/ruta-ep-ide/2.6.1-SNAPSHOT/ruta-ep-ide-2.6.1-SNAPSHOT.jar>
[INFO] Installing <https://builds.apache.org/job/UIMA-Ruta/ws/trunk/ruta-ep-ide/pom.xml>
to <https://builds.apache.org/job/UIMA-Ruta/ws/trunk/ruta-maven-plugin/target/local-repo/org/apache/uima/ruta-ep-ide/2.6.1-SNAPSHOT/ruta-ep-ide-2.6.1-SNAPSHOT.pom>
[INFO] Installing <https://builds.apache.org/job/UIMA-Ruta/ws/trunk/ruta-ep-ide-ui/pom.xml>
to <https://builds.apache.org/job/UIMA-Ruta/ws/trunk/ruta-maven-plugin/target/local-repo/org/apache/uima/ruta-ep-ide-ui/2.6.1-SNAPSHOT/ruta-ep-ide-ui-2.6.1-SNAPSHOT.pom>
[INFO] Installing <https://builds.apache.org/job/UIMA-Ruta/ws/trunk/ruta-ep-ide-ui/target/org.apache.uima.ruta.ide.ui_2.6.1.SNAPSHOT.jar>
to <https://builds.apache.org/job/UIMA-Ruta/ws/trunk/ruta-maven-plugin/target/local-repo/org/apache/uima/ruta-ep-ide-ui/2.6.1-SNAPSHOT/ruta-ep-ide-ui-2.6.1-SNAPSHOT.jar>
[INFO] Installing <https://builds.apache.org/job/UIMA-Ruta/ws/trunk/ruta-ep-ide-ui/pom.xml>
to <https://builds.apache.org/job/UIMA-Ruta/ws/trunk/ruta-maven-plugin/target/local-repo/org/apache/uima/ruta-ep-ide-ui/2.6.1-SNAPSHOT/ruta-ep-ide-ui-2.6.1-SNAPSHOT.pom>
[INFO] Installing <https://builds.apache.org/job/UIMA-Ruta/ws/trunk/ruta-ep-caseditor/pom.xml>
to <https://builds.apache.org/job/UIMA-Ruta/ws/trunk/ruta-maven-plugin/target/local-repo/org/apache/uima/ruta-ep-caseditor/2.6.1-SNAPSHOT/ruta-ep-caseditor-2.6.1-SNAPSHOT.pom>
[INFO] Installing <https://builds.apache.org/job/UIMA-Ruta/ws/trunk/ruta-ep-caseditor/target/org.apache.uima.ruta.caseditor_2.6.1.SNAPSHOT.jar>
to <https://builds.apache.org/job/UIMA-Ruta/ws/trunk/ruta-maven-plugin/target/local-repo/org/apache/uima/ruta-ep-caseditor/2.6.1-SNAPSHOT/ruta-ep-caseditor-2.6.1-SNAPSHOT.jar>
[INFO] Installing <https://builds.apache.org/job/UIMA-Ruta/ws/trunk/ruta-ep-caseditor/pom.xml>
to <https://builds.apache.org/job/UIMA-Ruta/ws/trunk/ruta-maven-plugin/target/local-repo/org/apache/uima/ruta-ep-caseditor/2.6.1-SNAPSHOT/ruta-ep-caseditor-2.6.1-SNAPSHOT.pom>
[INFO] Installing <https://builds.apache.org/job/UIMA-Ruta/ws/trunk/ruta-ep-addons/pom.xml>
to <https://builds.apache.org/job/UIMA-Ruta/ws/trunk/ruta-maven-plugin/target/local-repo/org/apache/uima/ruta-ep-addons/2.6.1-SNAPSHOT/ruta-ep-addons-2.6.1-SNAPSHOT.pom>
[INFO] Installing <https://builds.apache.org/job/UIMA-Ruta/ws/trunk/ruta-ep-addons/target/org.apache.uima.ruta.addons_2.6.1.SNAPSHOT.jar>
to <https://builds.apache.org/job/UIMA-Ruta/ws/trunk/ruta-maven-plugin/target/local-repo/org/apache/uima/ruta-ep-addons/2.6.1-SNAPSHOT/ruta-ep-addons-2.6.1-SNAPSHOT.jar>
[INFO] Installing <https://builds.apache.org/job/UIMA-Ruta/ws/trunk/ruta-ep-addons/pom.xml>
to <https://builds.apache.org/job/UIMA-Ruta/ws/trunk/ruta-maven-plugin/target/local-repo/org/apache/uima/ruta-ep-addons/2.6.1-SNAPSHOT/ruta-ep-addons-2.6.1-SNAPSHOT.pom>
[INFO] Installing <https://builds.apache.org/job/UIMA-Ruta/ws/trunk/ruta-ep-textruler/pom.xml>
to <https://builds.apache.org/job/UIMA-Ruta/ws/trunk/ruta-maven-plugin/target/local-repo/org/apache/uima/ruta-ep-textruler/2.6.1-SNAPSHOT/ruta-ep-textruler-2.6.1-SNAPSHOT.pom>
[INFO] Installing <https://builds.apache.org/job/UIMA-Ruta/ws/trunk/ruta-ep-textruler/target/org.apache.uima.ruta.textruler_2.6.1.SNAPSHOT.jar>
to <https://builds.apache.org/job/UIMA-Ruta/ws/trunk/ruta-maven-plugin/target/local-repo/org/apache/uima/ruta-ep-textruler/2.6.1-SNAPSHOT/ruta-ep-textruler-2.6.1-SNAPSHOT.jar>
[INFO] Installing <https://builds.apache.org/job/UIMA-Ruta/ws/trunk/ruta-ep-textruler/pom.xml>
to <https://builds.apache.org/job/UIMA-Ruta/ws/trunk/ruta-maven-plugin/target/local-repo/org/apache/uima/ruta-ep-textruler/2.6.1-SNAPSHOT/ruta-ep-textruler-2.6.1-SNAPSHOT.pom>
[INFO] Installing <https://builds.apache.org/job/UIMA-Ruta/ws/trunk/ruta-ep-core-ext/pom.xml>
to <https://builds.apache.org/job/UIMA-Ruta/ws/trunk/ruta-maven-plugin/target/local-repo/org/apache/uima/ruta-ep-core-ext/2.6.1-SNAPSHOT/ruta-ep-core-ext-2.6.1-SNAPSHOT.pom>
[INFO] Installing <https://builds.apache.org/job/UIMA-Ruta/ws/trunk/ruta-ep-core-ext/target/org.apache.uima.ruta.core.ext_2.6.1.SNAPSHOT.jar>
to <https://builds.apache.org/job/UIMA-Ruta/ws/trunk/ruta-maven-plugin/target/local-repo/org/apache/uima/ruta-ep-core-ext/2.6.1-SNAPSHOT/ruta-ep-core-ext-2.6.1-SNAPSHOT.jar>
[INFO] Installing <https://builds.apache.org/job/UIMA-Ruta/ws/trunk/ruta-ep-core-ext/pom.xml>
to <https://builds.apache.org/job/UIMA-Ruta/ws/trunk/ruta-maven-plugin/target/local-repo/org/apache/uima/ruta-ep-core-ext/2.6.1-SNAPSHOT/ruta-ep-core-ext-2.6.1-SNAPSHOT.pom>
[INFO] Installing <https://builds.apache.org/job/UIMA-Ruta/ws/trunk/ruta-maven-plugin/pom.xml>
to <https://builds.apache.org/job/UIMA-Ruta/ws/trunk/ruta-maven-plugin/target/local-repo/org/apache/uima/ruta-maven-plugin/2.6.1-SNAPSHOT/ruta-maven-plugin-2.6.1-SNAPSHOT.pom>
[INFO] Installing <https://builds.apache.org/job/UIMA-Ruta/ws/trunk/ruta-maven-plugin/target/ruta-maven-plugin-2.6.1-SNAPSHOT.jar>
to <https://builds.apache.org/job/UIMA-Ruta/ws/trunk/ruta-maven-plugin/target/local-repo/org/apache/uima/ruta-maven-plugin/2.6.1-SNAPSHOT/ruta-maven-plugin-2.6.1-SNAPSHOT.jar>
[INFO] 
[INFO] --- maven-invoker-plugin:2.0.0:run (integration-test) @ ruta-maven-plugin ---
[INFO] Building: importByName/pom.xml
[INFO] ..SUCCESS (10.2 s)
[INFO] Building: conflictingShortName/pom.xml
[INFO] ..SUCCESS (8.2 s)
[INFO] Building: multimodule/pom.xml
[INFO] ..SUCCESS (12.9 s)
[INFO] Building: wordlists/pom.xml
[INFO] ..SUCCESS (8.5 s)
[INFO] -------------------------------------------------
[INFO] Build Summary:
[INFO]   Passed: 4, Failed: 0, Errors: 0, Skipped: 0
[INFO] -------------------------------------------------
MavenInvokerArchiver
found reports:[<https://builds.apache.org/job/UIMA-Ruta/ws/trunk/ruta-maven-plugin/target/invoker-reports/BUILD-multimodule.xml,>
<https://builds.apache.org/job/UIMA-Ruta/ws/trunk/ruta-maven-plugin/target/invoker-reports/BUILD-conflictingShortName.xml,>
<https://builds.apache.org/job/UIMA-Ruta/ws/trunk/ruta-maven-plugin/target/invoker-reports/BUILD-wordlists.xml,>
<https://builds.apache.org/job/UIMA-Ruta/ws/trunk/ruta-maven-plugin/target/invoker-reports/BUILD-importByName.xml]>
java.lang.reflect.InvocationTargetException
	at sun.reflect.NativeMethodAccessorImpl.invoke0(Native Method)
	at sun.reflect.NativeMethodAccessorImpl.invoke(NativeMethodAccessorImpl.java:57)
	at sun.reflect.DelegatingMethodAccessorImpl.invoke(DelegatingMethodAccessorImpl.java:43)
	at java.lang.reflect.Method.invoke(Method.java:606)
	at org.codehaus.plexus.classworlds.launcher.Launcher.launchStandard(Launcher.java:329)
	at org.codehaus.plexus.classworlds.launcher.Launcher.launch(Launcher.java:239)
	at org.jvnet.hudson.maven3.agent.Maven3Main.launch(Maven3Main.java:181)
	at sun.reflect.NativeMethodAccessorImpl.invoke0(Native Method)
	at sun.reflect.NativeMethodAccessorImpl.invoke(NativeMethodAccessorImpl.java:57)
	at sun.reflect.DelegatingMethodAccessorImpl.invoke(DelegatingMethodAccessorImpl.java:43)
	at java.lang.reflect.Method.invoke(Method.java:606)
	at hudson.maven.Maven3Builder.call(Maven3Builder.java:139)
	at hudson.maven.Maven3Builder.call(Maven3Builder.java:70)
	at hudson.remoting.UserRequest.perform(UserRequest.java:153)
	at hudson.remoting.UserRequest.perform(UserRequest.java:50)
	at hudson.remoting.Request$2.run(Request.java:336)
	at hudson.remoting.InterceptingExecutorService$1.call(InterceptingExecutorService.java:68)
	at java.util.concurrent.FutureTask.run(FutureTask.java:262)
	at java.util.concurrent.ThreadPoolExecutor.runWorker(ThreadPoolExecutor.java:1145)
	at java.util.concurrent.ThreadPoolExecutor$Worker.run(ThreadPoolExecutor.java:615)
	at java.lang.Thread.run(Thread.java:745)
Caused by: java.lang.NoSuchMethodError: org.codehaus.plexus.util.xml.pull.MXParser.<init>(Lorg/codehaus/plexus/util/xml/pull/EntityReplacementMap;)V
	at org.apache.maven.plugin.invoker.model.io.xpp3.BuildJobXpp3Reader.read(BuildJobXpp3Reader.java:510)
	at org.apache.maven.plugin.invoker.model.io.xpp3.BuildJobXpp3Reader.read(BuildJobXpp3Reader.java:529)
	at org.apache.maven.plugin.invoker.model.io.xpp3.BuildJobXpp3Reader.read(BuildJobXpp3Reader.java:558)
	at org.jenkinsci.plugins.maveninvoker.MavenInvokerArchiver.postExecute(MavenInvokerArchiver.java:113)
	at hudson.maven.Maven3Builder$MavenExecutionListener.recordMojoEnded(Maven3Builder.java:629)
	at hudson.maven.Maven3Builder$MavenExecutionListener.mojoSucceeded(Maven3Builder.java:610)
	at org.apache.maven.lifecycle.internal.DefaultExecutionEventCatapult.fire(DefaultExecutionEventCatapult.java:87)
	at org.apache.maven.lifecycle.internal.DefaultExecutionEventCatapult.fire(DefaultExecutionEventCatapult.java:42)
	at org.apache.maven.lifecycle.internal.MojoExecutor.execute(MojoExecutor.java:228)
	at org.apache.maven.lifecycle.internal.MojoExecutor.execute(MojoExecutor.java:153)
	at org.apache.maven.lifecycle.internal.MojoExecutor.execute(MojoExecutor.java:145)
	at org.apache.maven.lifecycle.internal.LifecycleModuleBuilder.buildProject(LifecycleModuleBuilder.java:84)
	at org.apache.maven.lifecycle.internal.LifecycleModuleBuilder.buildProject(LifecycleModuleBuilder.java:59)
	at org.apache.maven.lifecycle.internal.LifecycleStarter.singleThreadedBuild(LifecycleStarter.java:183)
	at org.apache.maven.lifecycle.internal.LifecycleStarter.execute(LifecycleStarter.java:161)
	at org.apache.maven.DefaultMaven.doExecute(DefaultMaven.java:320)
	at org.apache.maven.DefaultMaven.execute(DefaultMaven.java:156)
	at org.jvnet.hudson.maven3.launcher.Maven3Launcher.main(Maven3Launcher.java:117)
	... 21 more
ERROR: Failed to parse POMs
java.io.IOException: java.lang.reflect.InvocationTargetException
	at hudson.maven.Maven3Builder.call(Maven3Builder.java:179)
	at hudson.maven.Maven3Builder.call(Maven3Builder.java:70)
	at hudson.remoting.UserRequest.perform(UserRequest.java:153)
	at hudson.remoting.UserRequest.perform(UserRequest.java:50)
	at hudson.remoting.Request$2.run(Request.java:336)
	at hudson.remoting.InterceptingExecutorService$1.call(InterceptingExecutorService.java:68)
	at java.util.concurrent.FutureTask.run(FutureTask.java:262)
	at java.util.concurrent.ThreadPoolExecutor.runWorker(ThreadPoolExecutor.java:1145)
	at java.util.concurrent.ThreadPoolExecutor$Worker.run(ThreadPoolExecutor.java:615)
	at java.lang.Thread.run(Thread.java:745)
	at ......remote call to Channel to Maven [/home/jenkins/tools/java/latest1.7/bin/java, -Xmx800m,
-XX:MaxPermSize=256m, -cp, /home/jenkins/jenkins-slave/maven3-agent.jar:/home/jenkins/tools/maven/apache-maven-3.0.4/boot/plexus-classworlds-2.4.jar,
org.jvnet.hudson.maven3.agent.Maven3Main, /home/jenkins/tools/maven/apache-maven-3.0.4, /home/jenkins/jenkins-slave/slave.jar,
/home/jenkins/jenkins-slave/maven3-interceptor.jar, /home/jenkins/jenkins-slave/maven3-interceptor-commons.jar,
41810](Native Method)
	at hudson.remoting.Channel.attachCallSiteStackTrace(Channel.java:1545)
	at hudson.remoting.UserResponse.retrieve(UserRequest.java:253)
	at hudson.remoting.Channel.call(Channel.java:830)
	at hudson.maven.ProcessCache$MavenProcess.call(ProcessCache.java:161)
	at hudson.maven.MavenModuleSetBuild$MavenModuleSetBuildExecution.doRun(MavenModuleSetBuild.java:878)
	at hudson.model.AbstractBuild$AbstractBuildExecution.run(AbstractBuild.java:534)
	at hudson.model.Run.execute(Run.java:1728)
	at hudson.maven.MavenModuleSetBuild.run(MavenModuleSetBuild.java:542)
	at hudson.model.ResourceController.execute(ResourceController.java:98)
	at hudson.model.Executor.run(Executor.java:405)
Caused by: java.lang.reflect.InvocationTargetException
	at sun.reflect.NativeMethodAccessorImpl.invoke0(Native Method)
	at sun.reflect.NativeMethodAccessorImpl.invoke(NativeMethodAccessorImpl.java:57)
	at sun.reflect.DelegatingMethodAccessorImpl.invoke(DelegatingMethodAccessorImpl.java:43)
	at java.lang.reflect.Method.invoke(Method.java:606)
	at hudson.maven.Maven3Builder.call(Maven3Builder.java:139)
	at hudson.maven.Maven3Builder.call(Maven3Builder.java:70)
	at hudson.remoting.UserRequest.perform(UserRequest.java:153)
	at hudson.remoting.UserRequest.perform(UserRequest.java:50)
	at hudson.remoting.Request$2.run(Request.java:336)
	at hudson.remoting.InterceptingExecutorService$1.call(InterceptingExecutorService.java:68)
	at java.util.concurrent.FutureTask.run(FutureTask.java:262)
	at java.util.concurrent.ThreadPoolExecutor.runWorker(ThreadPoolExecutor.java:1145)
	at java.util.concurrent.ThreadPoolExecutor$Worker.run(ThreadPoolExecutor.java:615)
	at java.lang.Thread.run(Thread.java:745)
Caused by: java.lang.Exception: java.lang.reflect.InvocationTargetException
	at org.jvnet.hudson.maven3.agent.Maven3Main.launch(Maven3Main.java:184)
	... 14 more
Caused by: java.lang.reflect.InvocationTargetException
	at sun.reflect.NativeMethodAccessorImpl.invoke0(Native Method)
	at sun.reflect.NativeMethodAccessorImpl.invoke(NativeMethodAccessorImpl.java:57)
	at sun.reflect.DelegatingMethodAccessorImpl.invoke(DelegatingMethodAccessorImpl.java:43)
	at java.lang.reflect.Method.invoke(Method.java:606)
	at org.codehaus.plexus.classworlds.launcher.Launcher.launchStandard(Launcher.java:329)
	at org.codehaus.plexus.classworlds.launcher.Launcher.launch(Launcher.java:239)
	at org.jvnet.hudson.maven3.agent.Maven3Main.launch(Maven3Main.java:181)
	... 14 more
Caused by: java.lang.NoSuchMethodError: org.codehaus.plexus.util.xml.pull.MXParser.<init>(Lorg/codehaus/plexus/util/xml/pull/EntityReplacementMap;)V
	at org.apache.maven.plugin.invoker.model.io.xpp3.BuildJobXpp3Reader.read(BuildJobXpp3Reader.java:510)
	at org.apache.maven.plugin.invoker.model.io.xpp3.BuildJobXpp3Reader.read(BuildJobXpp3Reader.java:529)
	at org.apache.maven.plugin.invoker.model.io.xpp3.BuildJobXpp3Reader.read(BuildJobXpp3Reader.java:558)
	at org.jenkinsci.plugins.maveninvoker.MavenInvokerArchiver.postExecute(MavenInvokerArchiver.java:113)
	at hudson.maven.Maven3Builder$MavenExecutionListener.recordMojoEnded(Maven3Builder.java:629)
	at hudson.maven.Maven3Builder$MavenExecutionListener.mojoSucceeded(Maven3Builder.java:610)
	at org.apache.maven.lifecycle.internal.DefaultExecutionEventCatapult.fire(DefaultExecutionEventCatapult.java:87)
	at org.apache.maven.lifecycle.internal.DefaultExecutionEventCatapult.fire(DefaultExecutionEventCatapult.java:42)
	at org.apache.maven.lifecycle.internal.MojoExecutor.execute(MojoExecutor.java:228)
	at org.apache.maven.lifecycle.internal.MojoExecutor.execute(MojoExecutor.java:153)
	at org.apache.maven.lifecycle.internal.MojoExecutor.execute(MojoExecutor.java:145)
	at org.apache.maven.lifecycle.internal.LifecycleModuleBuilder.buildProject(LifecycleModuleBuilder.java:84)
	at org.apache.maven.lifecycle.internal.LifecycleModuleBuilder.buildProject(LifecycleModuleBuilder.java:59)
	at org.apache.maven.lifecycle.internal.LifecycleStarter.singleThreadedBuild(LifecycleStarter.java:183)
	at org.apache.maven.lifecycle.internal.LifecycleStarter.execute(LifecycleStarter.java:161)
	at org.apache.maven.DefaultMaven.doExecute(DefaultMaven.java:320)
	at org.apache.maven.DefaultMaven.execute(DefaultMaven.java:156)
	at org.jvnet.hudson.maven3.launcher.Maven3Launcher.main(Maven3Launcher.java:117)
	... 21 more
channel stopped
[WARNINGS] Skipping publisher since build result is FAILURE
Skipping Cobertura coverage report as build was not UNSTABLE or better ...

Mime
View raw message