uima-dev mailing list archives

Site index · List index
Message view « Date » · « Thread »
Top « Date » · « Thread »
From Apache Jenkins Server <jenk...@builds.apache.org>
Subject Build failed in Jenkins: UIMA-Ruta Java 11 #12
Date Wed, 21 Aug 2019 14:13:17 GMT
See <https://builds.apache.org/job/UIMA-Ruta%20Java%2011/12/display/redirect?page=changes>

Changes:

[pkluegl] UIMA-6119: added ignored test reproducing the problem

------------------------------------------
[...truncated 1.97 MB...]
[INFO] 
[INFO] --- maven-enforcer-plugin:3.0.0-M2:enforce (enforce-maven-version) @ ruta-ep-core-ext
---
[INFO] 
[INFO] --- maven-enforcer-plugin:3.0.0-M2:enforce (enforce-versions) @ ruta-ep-core-ext ---
[WARNING] Failed to getClass for org.apache.maven.plugins.javadoc.JavadocReport
[INFO] 
[INFO] <<< maven-javadoc-plugin:3.0.1:javadoc (default-cli) < generate-sources
@ ruta-ep-core-ext <<<
[INFO] 
[INFO] --- maven-javadoc-plugin:3.0.1:javadoc (default-cli) @ ruta-ep-core-ext ---
[WARNING] Are you sure about the <javadocVersion/> parameter? It seems to be 11.0.1
[JENKINS] Archiving  javadoc
[INFO]                                                                         
[INFO] ------------------------------------------------------------------------
[INFO] Building Apache UIMA Maven: ruta-maven-plugin 2.7.1-SNAPSHOT
[INFO] ------------------------------------------------------------------------
[WARNING] The POM for org.eclipse.m2e:lifecycle-mapping:jar:1.0.0 is missing, no dependency
information available
[WARNING] Failed to retrieve plugin descriptor for org.eclipse.m2e:lifecycle-mapping:1.0.0:
Plugin org.eclipse.m2e:lifecycle-mapping:1.0.0 or one of its dependencies could not be resolved:
Failure to find org.eclipse.m2e:lifecycle-mapping:jar:1.0.0 in https://repo.maven.apache.org/maven2
was cached in the local repository, resolution will not be reattempted until the update interval
of central has elapsed or updates are forced
[WARNING] The POM for org.eclipse.m2e:lifecycle-mapping:jar:1.0.0 is missing, no dependency
information available
[WARNING] Failed to retrieve plugin descriptor for org.eclipse.m2e:lifecycle-mapping:1.0.0:
Plugin org.eclipse.m2e:lifecycle-mapping:1.0.0 or one of its dependencies could not be resolved:
Failure to find org.eclipse.m2e:lifecycle-mapping:jar:1.0.0 in https://repo.maven.apache.org/maven2
was cached in the local repository, resolution will not be reattempted until the update interval
of central has elapsed or updates are forced
[WARNING] The POM for org.eclipse.m2e:lifecycle-mapping:jar:1.0.0 is missing, no dependency
information available
[WARNING] Failed to retrieve plugin descriptor for org.eclipse.m2e:lifecycle-mapping:1.0.0:
Plugin org.eclipse.m2e:lifecycle-mapping:1.0.0 or one of its dependencies could not be resolved:
Failure to find org.eclipse.m2e:lifecycle-mapping:jar:1.0.0 in https://repo.maven.apache.org/maven2
was cached in the local repository, resolution will not be reattempted until the update interval
of central has elapsed or updates are forced
[INFO] 
[INFO] --- maven-clean-plugin:3.1.0:clean (default-clean) @ ruta-maven-plugin ---
[TASKS] Scanning folder '<https://builds.apache.org/job/UIMA-Ruta%20Java%2011/ws/trunk/ruta-maven-plugin'>
for files matching the pattern '**/*.java' - excludes: 
[TASKS] Found 9 files to scan for tasks
Found 1 open tasks.
[INFO] 
[INFO] --- build-helper-maven-plugin:3.0.0:parse-version (parse-project-version) @ ruta-maven-plugin
---
[INFO] 
[INFO] --- uima-build-helper-maven-plugin:7:parse-date-time (set buildYear and buildMonth)
@ ruta-maven-plugin ---
[INFO] 
[INFO] --- maven-enforcer-plugin:3.0.0-M2:enforce (enforce-maven-version) @ ruta-maven-plugin
---
[INFO] 
[INFO] --- maven-enforcer-plugin:3.0.0-M2:enforce (enforce-versions) @ ruta-maven-plugin ---
[INFO] 
[INFO] --- maven-plugin-plugin:3.5.2:helpmojo (generate-helpmojo) @ ruta-maven-plugin ---
[INFO] Using 'UTF-8' encoding to read mojo source files.
[INFO] java-annotations mojo extractor found 0 mojo descriptor.
[INFO] 
[INFO] --- maven-remote-resources-plugin:1.5:process (process-resource-bundles) @ ruta-maven-plugin
---
[INFO] 
[INFO] --- maven-remote-resources-plugin:1.5:process (default) @ ruta-maven-plugin ---
[INFO] 
[INFO] --- maven-resources-plugin:3.1.0:resources (default-resources) @ ruta-maven-plugin
---
[INFO] Using 'UTF-8' encoding to copy filtered resources.
[INFO] Copying 1 resource
[INFO] Copying 3 resources
[INFO] Copying 3 resources
[INFO] 
[INFO] --- maven-compiler-plugin:3.8.0:compile (default-compile) @ ruta-maven-plugin ---
[INFO] Changes detected - recompiling the module!
[INFO] Compiling 5 source files to <https://builds.apache.org/job/UIMA-Ruta%20Java%2011/ws/trunk/ruta-maven-plugin/target/classes>
[INFO] 
[INFO] --- maven-plugin-plugin:3.5.2:descriptor (default-descriptor) @ ruta-maven-plugin ---
[INFO] Using 'UTF-8' encoding to read mojo source files.
[INFO] java-annotations mojo extractor found 4 mojo descriptors.
[INFO] 
[INFO] --- maven-resources-plugin:3.1.0:testResources (default-testResources) @ ruta-maven-plugin
---
[INFO] Using 'UTF-8' encoding to copy filtered resources.
[INFO] Copying 2 resources
[INFO] Copying 3 resources
[INFO] Copying 3 resources
[INFO] 
[INFO] --- maven-compiler-plugin:3.8.0:testCompile (default-testCompile) @ ruta-maven-plugin
---
[INFO] Changes detected - recompiling the module!
[INFO] Compiling 1 source file to <https://builds.apache.org/job/UIMA-Ruta%20Java%2011/ws/trunk/ruta-maven-plugin/target/test-classes>
[INFO] 
[INFO] --- maven-surefire-plugin:2.22.1:test (default-test) @ ruta-maven-plugin ---
[INFO] 
[INFO] -------------------------------------------------------
[INFO]  T E S T S
[INFO] -------------------------------------------------------
[INFO] Running org.apache.uima.ruta.maven.RutaGenerateDescriptorMojoTest
[debug] Classpath entry: <https://builds.apache.org/job/UIMA-Ruta%20Java%2011/ws/trunk/ruta-maven-plugin/target/project-simple-test/src/main/java>
[debug] Classpath entry: <https://builds.apache.org/job/UIMA-Ruta%20Java%2011/ws/trunk/ruta-maven-plugin/target/project-simple-test/target/generated-sources/ruta/descriptor>
[debug] Classpath entry: <https://builds.apache.org/job/UIMA-Ruta%20Java%2011/ws/trunk/ruta-maven-plugin/target/project-simple-test/src/main/resources>
[debug] Classpath entry: <https://builds.apache.org/job/UIMA-Ruta%20Java%2011/ws/trunk/ruta-maven-plugin/target/project-simple-test/target/classes>
[debug] Writing descriptor to: <https://builds.apache.org/job/UIMA-Ruta%20Java%2011/ws/trunk/ruta-maven-plugin/target/project-simple-test/target/generated-sources/ruta/descriptor/SimpleEngine.xml>
[debug] Writing descriptor to: <https://builds.apache.org/job/UIMA-Ruta%20Java%2011/ws/trunk/ruta-maven-plugin/target/project-simple-test/target/generated-sources/ruta/descriptor/SimpleTypeSystem.xml>
[INFO] Tests run: 1, Failures: 0, Errors: 0, Skipped: 0, Time elapsed: 2.6 s - in org.apache.uima.ruta.maven.RutaGenerateDescriptorMojoTest
[INFO] 
[INFO] Results:
[INFO] 
[INFO] Tests run: 1, Failures: 0, Errors: 0, Skipped: 0
[INFO] 
[JENKINS] Recording test results
[INFO] 
[INFO] --- maven-antrun-plugin:1.8:run (dup-meta-jar-cleanup) @ ruta-maven-plugin ---
[INFO] Executing tasks

main:
[INFO] Executed tasks
[INFO] 
[INFO] --- maven-resources-plugin:3.1.0:copy-resources (copy customized bin LICENSE file)
@ ruta-maven-plugin ---
[INFO] Using 'UTF-8' encoding to copy filtered resources.
[INFO] skip non existing resourceDirectory <https://builds.apache.org/job/UIMA-Ruta%20Java%2011/ws/trunk/ruta-maven-plugin/src/main/readme_bin>
[INFO] 
[INFO] --- maven-jar-plugin:3.1.0:jar (default-jar) @ ruta-maven-plugin ---
[INFO] Building jar: <https://builds.apache.org/job/UIMA-Ruta%20Java%2011/ws/trunk/ruta-maven-plugin/target/ruta-maven-plugin-2.7.1-SNAPSHOT.jar>
[INFO] 
[INFO] --- maven-plugin-plugin:3.5.2:addPluginArtifactMetadata (default-addPluginArtifactMetadata)
@ ruta-maven-plugin ---
[INFO] 
[INFO] --- maven-site-plugin:3.7.1:attach-descriptor (attach-descriptor) @ ruta-maven-plugin
---
[INFO] Skipping because packaging 'maven-plugin' is not pom.
[INFO] 
[INFO] --- maven-invoker-plugin:2.0.0:install (integration-test) @ ruta-maven-plugin ---
[INFO] Installing <https://builds.apache.org/job/UIMA-Ruta%20Java%2011/ws/trunk/ruta-parent/pom.xml>
to <https://builds.apache.org/job/UIMA-Ruta%20Java%2011/ws/trunk/ruta-maven-plugin/target/local-repo/org/apache/uima/ruta-parent/2.7.1-SNAPSHOT/ruta-parent-2.7.1-SNAPSHOT.pom>
[INFO] Installing <https://builds.apache.org/job/UIMA-Ruta%20Java%2011/ws/trunk/ruta-basic-type/pom.xml>
to <https://builds.apache.org/job/UIMA-Ruta%20Java%2011/ws/trunk/ruta-maven-plugin/target/local-repo/org/apache/uima/ruta-basic-type/2.7.1-SNAPSHOT/ruta-basic-type-2.7.1-SNAPSHOT.pom>
[INFO] Installing <https://builds.apache.org/job/UIMA-Ruta%20Java%2011/ws/trunk/ruta-basic-type/target/ruta-basic-type-2.7.1-SNAPSHOT.jar>
to <https://builds.apache.org/job/UIMA-Ruta%20Java%2011/ws/trunk/ruta-maven-plugin/target/local-repo/org/apache/uima/ruta-basic-type/2.7.1-SNAPSHOT/ruta-basic-type-2.7.1-SNAPSHOT.jar>
[INFO] Installing <https://builds.apache.org/job/UIMA-Ruta%20Java%2011/ws/trunk/ruta-basic-type/pom.xml>
to <https://builds.apache.org/job/UIMA-Ruta%20Java%2011/ws/trunk/ruta-maven-plugin/target/local-repo/org/apache/uima/ruta-basic-type/2.7.1-SNAPSHOT/ruta-basic-type-2.7.1-SNAPSHOT.pom>
[INFO] Installing <https://builds.apache.org/job/UIMA-Ruta%20Java%2011/ws/trunk/ruta-typesystem/pom.xml>
to <https://builds.apache.org/job/UIMA-Ruta%20Java%2011/ws/trunk/ruta-maven-plugin/target/local-repo/org/apache/uima/ruta-typesystem/2.7.1-SNAPSHOT/ruta-typesystem-2.7.1-SNAPSHOT.pom>
[INFO] Installing <https://builds.apache.org/job/UIMA-Ruta%20Java%2011/ws/trunk/ruta-typesystem/target/ruta-typesystem-2.7.1-SNAPSHOT.jar>
to <https://builds.apache.org/job/UIMA-Ruta%20Java%2011/ws/trunk/ruta-maven-plugin/target/local-repo/org/apache/uima/ruta-typesystem/2.7.1-SNAPSHOT/ruta-typesystem-2.7.1-SNAPSHOT.jar>
[INFO] Installing <https://builds.apache.org/job/UIMA-Ruta%20Java%2011/ws/trunk/ruta-typesystem/pom.xml>
to <https://builds.apache.org/job/UIMA-Ruta%20Java%2011/ws/trunk/ruta-maven-plugin/target/local-repo/org/apache/uima/ruta-typesystem/2.7.1-SNAPSHOT/ruta-typesystem-2.7.1-SNAPSHOT.pom>
[INFO] Installing <https://builds.apache.org/job/UIMA-Ruta%20Java%2011/ws/trunk/ruta-core/pom.xml>
to <https://builds.apache.org/job/UIMA-Ruta%20Java%2011/ws/trunk/ruta-maven-plugin/target/local-repo/org/apache/uima/ruta-core/2.7.1-SNAPSHOT/ruta-core-2.7.1-SNAPSHOT.pom>
[INFO] Installing <https://builds.apache.org/job/UIMA-Ruta%20Java%2011/ws/trunk/ruta-core/target/ruta-core-2.7.1-SNAPSHOT.jar>
to <https://builds.apache.org/job/UIMA-Ruta%20Java%2011/ws/trunk/ruta-maven-plugin/target/local-repo/org/apache/uima/ruta-core/2.7.1-SNAPSHOT/ruta-core-2.7.1-SNAPSHOT.jar>
[INFO] Installing <https://builds.apache.org/job/UIMA-Ruta%20Java%2011/ws/trunk/ruta-core/pom.xml>
to <https://builds.apache.org/job/UIMA-Ruta%20Java%2011/ws/trunk/ruta-maven-plugin/target/local-repo/org/apache/uima/ruta-core/2.7.1-SNAPSHOT/ruta-core-2.7.1-SNAPSHOT.pom>
[INFO] Installing <https://builds.apache.org/job/UIMA-Ruta%20Java%2011/ws/trunk/ruta-core-ext/pom.xml>
to <https://builds.apache.org/job/UIMA-Ruta%20Java%2011/ws/trunk/ruta-maven-plugin/target/local-repo/org/apache/uima/ruta-core-ext/2.7.1-SNAPSHOT/ruta-core-ext-2.7.1-SNAPSHOT.pom>
[INFO] Installing <https://builds.apache.org/job/UIMA-Ruta%20Java%2011/ws/trunk/ruta-core-ext/target/ruta-core-ext-2.7.1-SNAPSHOT.jar>
to <https://builds.apache.org/job/UIMA-Ruta%20Java%2011/ws/trunk/ruta-maven-plugin/target/local-repo/org/apache/uima/ruta-core-ext/2.7.1-SNAPSHOT/ruta-core-ext-2.7.1-SNAPSHOT.jar>
[INFO] Installing <https://builds.apache.org/job/UIMA-Ruta%20Java%2011/ws/trunk/ruta-core-ext/pom.xml>
to <https://builds.apache.org/job/UIMA-Ruta%20Java%2011/ws/trunk/ruta-maven-plugin/target/local-repo/org/apache/uima/ruta-core-ext/2.7.1-SNAPSHOT/ruta-core-ext-2.7.1-SNAPSHOT.pom>
[INFO] Installing <https://builds.apache.org/job/UIMA-Ruta%20Java%2011/ws/trunk/ruta-ep-parent/pom.xml>
to <https://builds.apache.org/job/UIMA-Ruta%20Java%2011/ws/trunk/ruta-maven-plugin/target/local-repo/org/apache/uima/ruta-ep-parent/2.7.1-SNAPSHOT/ruta-ep-parent-2.7.1-SNAPSHOT.pom>
[INFO] Installing <https://builds.apache.org/job/UIMA-Ruta%20Java%2011/ws/trunk/ruta-ep-engine/pom.xml>
to <https://builds.apache.org/job/UIMA-Ruta%20Java%2011/ws/trunk/ruta-maven-plugin/target/local-repo/org/apache/uima/ruta-ep-engine/2.7.1-SNAPSHOT/ruta-ep-engine-2.7.1-SNAPSHOT.pom>
[INFO] Installing <https://builds.apache.org/job/UIMA-Ruta%20Java%2011/ws/trunk/ruta-ep-engine/target/org.apache.uima.ruta.engine_2.7.1.SNAPSHOT.jar>
to <https://builds.apache.org/job/UIMA-Ruta%20Java%2011/ws/trunk/ruta-maven-plugin/target/local-repo/org/apache/uima/ruta-ep-engine/2.7.1-SNAPSHOT/ruta-ep-engine-2.7.1-SNAPSHOT.jar>
[INFO] Installing <https://builds.apache.org/job/UIMA-Ruta%20Java%2011/ws/trunk/ruta-ep-engine/pom.xml>
to <https://builds.apache.org/job/UIMA-Ruta%20Java%2011/ws/trunk/ruta-maven-plugin/target/local-repo/org/apache/uima/ruta-ep-engine/2.7.1-SNAPSHOT/ruta-ep-engine-2.7.1-SNAPSHOT.pom>
[INFO] Installing <https://builds.apache.org/job/UIMA-Ruta%20Java%2011/ws/trunk/ruta-ep-ide/pom.xml>
to <https://builds.apache.org/job/UIMA-Ruta%20Java%2011/ws/trunk/ruta-maven-plugin/target/local-repo/org/apache/uima/ruta-ep-ide/2.7.1-SNAPSHOT/ruta-ep-ide-2.7.1-SNAPSHOT.pom>
[INFO] Installing <https://builds.apache.org/job/UIMA-Ruta%20Java%2011/ws/trunk/ruta-ep-ide/target/org.apache.uima.ruta.ide_2.7.1.SNAPSHOT.jar>
to <https://builds.apache.org/job/UIMA-Ruta%20Java%2011/ws/trunk/ruta-maven-plugin/target/local-repo/org/apache/uima/ruta-ep-ide/2.7.1-SNAPSHOT/ruta-ep-ide-2.7.1-SNAPSHOT.jar>
[INFO] Installing <https://builds.apache.org/job/UIMA-Ruta%20Java%2011/ws/trunk/ruta-ep-ide/pom.xml>
to <https://builds.apache.org/job/UIMA-Ruta%20Java%2011/ws/trunk/ruta-maven-plugin/target/local-repo/org/apache/uima/ruta-ep-ide/2.7.1-SNAPSHOT/ruta-ep-ide-2.7.1-SNAPSHOT.pom>
[INFO] Installing <https://builds.apache.org/job/UIMA-Ruta%20Java%2011/ws/trunk/ruta-ep-ide-ui/pom.xml>
to <https://builds.apache.org/job/UIMA-Ruta%20Java%2011/ws/trunk/ruta-maven-plugin/target/local-repo/org/apache/uima/ruta-ep-ide-ui/2.7.1-SNAPSHOT/ruta-ep-ide-ui-2.7.1-SNAPSHOT.pom>
[INFO] Installing <https://builds.apache.org/job/UIMA-Ruta%20Java%2011/ws/trunk/ruta-ep-ide-ui/target/org.apache.uima.ruta.ide.ui_2.7.1.SNAPSHOT.jar>
to <https://builds.apache.org/job/UIMA-Ruta%20Java%2011/ws/trunk/ruta-maven-plugin/target/local-repo/org/apache/uima/ruta-ep-ide-ui/2.7.1-SNAPSHOT/ruta-ep-ide-ui-2.7.1-SNAPSHOT.jar>
[INFO] Installing <https://builds.apache.org/job/UIMA-Ruta%20Java%2011/ws/trunk/ruta-ep-ide-ui/pom.xml>
to <https://builds.apache.org/job/UIMA-Ruta%20Java%2011/ws/trunk/ruta-maven-plugin/target/local-repo/org/apache/uima/ruta-ep-ide-ui/2.7.1-SNAPSHOT/ruta-ep-ide-ui-2.7.1-SNAPSHOT.pom>
[INFO] Installing <https://builds.apache.org/job/UIMA-Ruta%20Java%2011/ws/trunk/ruta-ep-caseditor/pom.xml>
to <https://builds.apache.org/job/UIMA-Ruta%20Java%2011/ws/trunk/ruta-maven-plugin/target/local-repo/org/apache/uima/ruta-ep-caseditor/2.7.1-SNAPSHOT/ruta-ep-caseditor-2.7.1-SNAPSHOT.pom>
[INFO] Installing <https://builds.apache.org/job/UIMA-Ruta%20Java%2011/ws/trunk/ruta-ep-caseditor/target/org.apache.uima.ruta.caseditor_2.7.1.SNAPSHOT.jar>
to <https://builds.apache.org/job/UIMA-Ruta%20Java%2011/ws/trunk/ruta-maven-plugin/target/local-repo/org/apache/uima/ruta-ep-caseditor/2.7.1-SNAPSHOT/ruta-ep-caseditor-2.7.1-SNAPSHOT.jar>
[INFO] Installing <https://builds.apache.org/job/UIMA-Ruta%20Java%2011/ws/trunk/ruta-ep-caseditor/pom.xml>
to <https://builds.apache.org/job/UIMA-Ruta%20Java%2011/ws/trunk/ruta-maven-plugin/target/local-repo/org/apache/uima/ruta-ep-caseditor/2.7.1-SNAPSHOT/ruta-ep-caseditor-2.7.1-SNAPSHOT.pom>
[INFO] Installing <https://builds.apache.org/job/UIMA-Ruta%20Java%2011/ws/trunk/ruta-ep-addons/pom.xml>
to <https://builds.apache.org/job/UIMA-Ruta%20Java%2011/ws/trunk/ruta-maven-plugin/target/local-repo/org/apache/uima/ruta-ep-addons/2.7.1-SNAPSHOT/ruta-ep-addons-2.7.1-SNAPSHOT.pom>
[INFO] Installing <https://builds.apache.org/job/UIMA-Ruta%20Java%2011/ws/trunk/ruta-ep-addons/target/org.apache.uima.ruta.addons_2.7.1.SNAPSHOT.jar>
to <https://builds.apache.org/job/UIMA-Ruta%20Java%2011/ws/trunk/ruta-maven-plugin/target/local-repo/org/apache/uima/ruta-ep-addons/2.7.1-SNAPSHOT/ruta-ep-addons-2.7.1-SNAPSHOT.jar>
[INFO] Installing <https://builds.apache.org/job/UIMA-Ruta%20Java%2011/ws/trunk/ruta-ep-addons/pom.xml>
to <https://builds.apache.org/job/UIMA-Ruta%20Java%2011/ws/trunk/ruta-maven-plugin/target/local-repo/org/apache/uima/ruta-ep-addons/2.7.1-SNAPSHOT/ruta-ep-addons-2.7.1-SNAPSHOT.pom>
[INFO] Installing <https://builds.apache.org/job/UIMA-Ruta%20Java%2011/ws/trunk/ruta-ep-textruler/pom.xml>
to <https://builds.apache.org/job/UIMA-Ruta%20Java%2011/ws/trunk/ruta-maven-plugin/target/local-repo/org/apache/uima/ruta-ep-textruler/2.7.1-SNAPSHOT/ruta-ep-textruler-2.7.1-SNAPSHOT.pom>
[INFO] Installing <https://builds.apache.org/job/UIMA-Ruta%20Java%2011/ws/trunk/ruta-ep-textruler/target/org.apache.uima.ruta.textruler_2.7.1.SNAPSHOT.jar>
to <https://builds.apache.org/job/UIMA-Ruta%20Java%2011/ws/trunk/ruta-maven-plugin/target/local-repo/org/apache/uima/ruta-ep-textruler/2.7.1-SNAPSHOT/ruta-ep-textruler-2.7.1-SNAPSHOT.jar>
[INFO] Installing <https://builds.apache.org/job/UIMA-Ruta%20Java%2011/ws/trunk/ruta-ep-textruler/pom.xml>
to <https://builds.apache.org/job/UIMA-Ruta%20Java%2011/ws/trunk/ruta-maven-plugin/target/local-repo/org/apache/uima/ruta-ep-textruler/2.7.1-SNAPSHOT/ruta-ep-textruler-2.7.1-SNAPSHOT.pom>
[INFO] Installing <https://builds.apache.org/job/UIMA-Ruta%20Java%2011/ws/trunk/ruta-ep-core-ext/pom.xml>
to <https://builds.apache.org/job/UIMA-Ruta%20Java%2011/ws/trunk/ruta-maven-plugin/target/local-repo/org/apache/uima/ruta-ep-core-ext/2.7.1-SNAPSHOT/ruta-ep-core-ext-2.7.1-SNAPSHOT.pom>
[INFO] Installing <https://builds.apache.org/job/UIMA-Ruta%20Java%2011/ws/trunk/ruta-ep-core-ext/target/org.apache.uima.ruta.core.ext_2.7.1.SNAPSHOT.jar>
to <https://builds.apache.org/job/UIMA-Ruta%20Java%2011/ws/trunk/ruta-maven-plugin/target/local-repo/org/apache/uima/ruta-ep-core-ext/2.7.1-SNAPSHOT/ruta-ep-core-ext-2.7.1-SNAPSHOT.jar>
[INFO] Installing <https://builds.apache.org/job/UIMA-Ruta%20Java%2011/ws/trunk/ruta-ep-core-ext/pom.xml>
to <https://builds.apache.org/job/UIMA-Ruta%20Java%2011/ws/trunk/ruta-maven-plugin/target/local-repo/org/apache/uima/ruta-ep-core-ext/2.7.1-SNAPSHOT/ruta-ep-core-ext-2.7.1-SNAPSHOT.pom>
[INFO] Installing <https://builds.apache.org/job/UIMA-Ruta%20Java%2011/ws/trunk/ruta-maven-plugin/pom.xml>
to <https://builds.apache.org/job/UIMA-Ruta%20Java%2011/ws/trunk/ruta-maven-plugin/target/local-repo/org/apache/uima/ruta-maven-plugin/2.7.1-SNAPSHOT/ruta-maven-plugin-2.7.1-SNAPSHOT.pom>
[INFO] Installing <https://builds.apache.org/job/UIMA-Ruta%20Java%2011/ws/trunk/ruta-maven-plugin/target/ruta-maven-plugin-2.7.1-SNAPSHOT.jar>
to <https://builds.apache.org/job/UIMA-Ruta%20Java%2011/ws/trunk/ruta-maven-plugin/target/local-repo/org/apache/uima/ruta-maven-plugin/2.7.1-SNAPSHOT/ruta-maven-plugin-2.7.1-SNAPSHOT.jar>
[INFO] 
[INFO] --- maven-invoker-plugin:2.0.0:run (integration-test) @ ruta-maven-plugin ---
[INFO] Building: wordlists/pom.xml
[INFO] ..SUCCESS (16.0 s)
[INFO] Building: importByName/pom.xml
[INFO] ..SUCCESS (11.6 s)
[INFO] Building: multimodule/pom.xml
[INFO] ..FAILED (8.0 s)
[INFO]   The build exited with code 1. See <https://builds.apache.org/job/UIMA-Ruta%20Java%2011/ws/trunk/ruta-maven-plugin/target/it/multimodule/build.log>
for details.
[INFO] Building: conflictingShortName/pom.xml
[INFO] ..SUCCESS (12.6 s)
[INFO] -------------------------------------------------
[INFO] Build Summary:
[INFO]   Passed: 3, Failed: 1, Errors: 0, Skipped: 0
[INFO] -------------------------------------------------
[ERROR] The following builds failed:
[ERROR] *  multimodule/pom.xml
[INFO] -------------------------------------------------
[INFO] ------------------------------------------------------------------------
[INFO] Reactor Summary:
[INFO] 
[INFO] Apache UIMA Ruta: ruta-parent ...................... SUCCESS [01:24 min]
[INFO] Apache UIMA Ruta: ruta-basic-type .................. SUCCESS [ 33.145 s]
[INFO] Apache UIMA Ruta: ruta-typesystem .................. SUCCESS [ 33.078 s]
[INFO] Apache UIMA Ruta: ruta-core ........................ SUCCESS [02:15 min]
[INFO] Apache UIMA Ruta: ruta-core-ext .................... SUCCESS [ 34.505 s]
[INFO] Apache UIMA Ruta: ruta-ep-parent ................... SUCCESS [04:50 min]
[INFO] Apache UIMA Ruta Eclipse: ruta-ep-engine ........... SUCCESS [ 31.275 s]
[INFO] Apache UIMA Ruta Eclipse: ruta-ep-ide .............. SUCCESS [05:23 min]
[INFO] Apache UIMA Ruta Eclipse: ruta-ep-ide-ui ........... SUCCESS [09:18 min]
[INFO] Apache UIMA Ruta Eclipse: ruta-ep-caseditor ........ SUCCESS [05:01 min]
[INFO] Apache UIMA Ruta Eclipse: ruta-ep-addons ........... SUCCESS [04:54 min]
[INFO] Apache UIMA Ruta Eclipse: ruta-ep-textruler ........ SUCCESS [05:42 min]
[INFO] Apache UIMA Ruta Eclipse: ruta-ep-core-ext ......... SUCCESS [04:22 min]
[INFO] Apache UIMA Maven: ruta-maven-plugin ............... FAILURE [01:14 min]
[INFO] Apache UIMA Maven: ruta-maven-archetype ............ SKIPPED
[INFO] Apache UIMA Ruta Documentation ..................... SKIPPED
[INFO] Apache UIMA Ruta Eclipse: ruta-eclipse-feature ..... SKIPPED
[INFO] Apache UIMA Ruta: ruta-ep-example-extensions ....... SKIPPED
[INFO] Apache UIMA Ruta: ruta-maven-example ............... SKIPPED
[INFO] Apache UIMA Ruta: ruta ............................. SKIPPED
[INFO] ------------------------------------------------------------------------
[INFO] BUILD FAILURE
[INFO] ------------------------------------------------------------------------
[INFO] Total time: 47:52 min
[INFO] Finished at: 2019-08-21T14:12:47+00:00
[INFO] Final Memory: 211M/737M
[INFO] ------------------------------------------------------------------------
Waiting for Jenkins to finish collecting data
[ERROR] Failed to execute goal org.apache.maven.plugins:maven-invoker-plugin:2.0.0:run (integration-test)
on project ruta-maven-plugin: 1 build failed. See console output above for details. ->
[Help 1]
[ERROR] 
[ERROR] To see the full stack trace of the errors, re-run Maven with the -e switch.
[ERROR] Re-run Maven using the -X switch to enable full debug logging.
[ERROR] 
[ERROR] For more information about the errors and possible solutions, please read the following
articles:
[ERROR] [Help 1] http://cwiki.apache.org/confluence/display/MAVEN/MojoFailureException
[ERROR] 
[ERROR] After correcting the problems, you can resume the build with the command
[ERROR]   mvn <goals> -rf :ruta-maven-plugin
[JENKINS] Archiving <https://builds.apache.org/job/UIMA-Ruta%20Java%2011/ws/trunk/ruta-ep-parent/pom.xml>
to org.apache.uima/ruta-ep-parent/2.7.1-SNAPSHOT/ruta-ep-parent-2.7.1-SNAPSHOT.pom
[JENKINS] Archiving <https://builds.apache.org/job/UIMA-Ruta%20Java%2011/ws/trunk/ruta-core-ext/pom.xml>
to org.apache.uima/ruta-core-ext/2.7.1-SNAPSHOT/ruta-core-ext-2.7.1-SNAPSHOT.pom
[JENKINS] Archiving <https://builds.apache.org/job/UIMA-Ruta%20Java%2011/ws/trunk/ruta-core-ext/target/ruta-core-ext-2.7.1-SNAPSHOT.jar>
to org.apache.uima/ruta-core-ext/2.7.1-SNAPSHOT/ruta-core-ext-2.7.1-SNAPSHOT.jar
[JENKINS] Archiving <https://builds.apache.org/job/UIMA-Ruta%20Java%2011/ws/trunk/ruta-ep-ide/pom.xml>
to org.apache.uima/ruta-ep-ide/2.7.1-SNAPSHOT/ruta-ep-ide-2.7.1-SNAPSHOT.pom
[JENKINS] Archiving <https://builds.apache.org/job/UIMA-Ruta%20Java%2011/ws/trunk/ruta-ep-ide/target/org.apache.uima.ruta.ide_2.7.1.SNAPSHOT.jar>
to org.apache.uima/ruta-ep-ide/2.7.1-SNAPSHOT/ruta-ep-ide-2.7.1-SNAPSHOT.jar
[Fast Archiver] Compressed 438.35 KB of artifacts by 29.2% relative to #11
[JENKINS] Archiving <https://builds.apache.org/job/UIMA-Ruta%20Java%2011/ws/trunk/ruta-ep-textruler/pom.xml>
to org.apache.uima/ruta-ep-textruler/2.7.1-SNAPSHOT/ruta-ep-textruler-2.7.1-SNAPSHOT.pom
[JENKINS] Archiving <https://builds.apache.org/job/UIMA-Ruta%20Java%2011/ws/trunk/ruta-ep-textruler/target/org.apache.uima.ruta.textruler_2.7.1.SNAPSHOT.jar>
to org.apache.uima/ruta-ep-textruler/2.7.1-SNAPSHOT/ruta-ep-textruler-2.7.1-SNAPSHOT.jar
[JENKINS] Archiving <https://builds.apache.org/job/UIMA-Ruta%20Java%2011/ws/trunk/ruta-ep-addons/pom.xml>
to org.apache.uima/ruta-ep-addons/2.7.1-SNAPSHOT/ruta-ep-addons-2.7.1-SNAPSHOT.pom
[JENKINS] Archiving <https://builds.apache.org/job/UIMA-Ruta%20Java%2011/ws/trunk/ruta-ep-addons/target/org.apache.uima.ruta.addons_2.7.1.SNAPSHOT.jar>
to org.apache.uima/ruta-ep-addons/2.7.1-SNAPSHOT/ruta-ep-addons-2.7.1-SNAPSHOT.jar
[JENKINS] Archiving <https://builds.apache.org/job/UIMA-Ruta%20Java%2011/ws/trunk/ruta-core/pom.xml>
to org.apache.uima/ruta-core/2.7.1-SNAPSHOT/ruta-core-2.7.1-SNAPSHOT.pom
[JENKINS] Archiving <https://builds.apache.org/job/UIMA-Ruta%20Java%2011/ws/trunk/ruta-core/target/ruta-core-2.7.1-SNAPSHOT.jar>
to org.apache.uima/ruta-core/2.7.1-SNAPSHOT/ruta-core-2.7.1-SNAPSHOT.jar
[Fast Archiver] Compressed 871.38 KB of artifacts by 14.7% relative to #11
[JENKINS] Archiving <https://builds.apache.org/job/UIMA-Ruta%20Java%2011/ws/trunk/ruta-eclipse-feature/pom.xml>
to org.apache.uima/ruta-eclipse-feature/2.7.1-SNAPSHOT/ruta-eclipse-feature-2.7.1-SNAPSHOT.pom
[Fast Archiver] No prior successful build to compare, so performing full copy of artifacts
[JENKINS] Archiving <https://builds.apache.org/job/UIMA-Ruta%20Java%2011/ws/trunk/example-projects/ruta-maven-example/pom.xml>
to org.apache.uima/ruta-maven-example/2.7.1-SNAPSHOT/ruta-maven-example-2.7.1-SNAPSHOT.pom
[Fast Archiver] No prior successful build to compare, so performing full copy of artifacts
[JENKINS] Archiving <https://builds.apache.org/job/UIMA-Ruta%20Java%2011/ws/trunk/ruta-ep-caseditor/pom.xml>
to org.apache.uima/ruta-ep-caseditor/2.7.1-SNAPSHOT/ruta-ep-caseditor-2.7.1-SNAPSHOT.pom
[JENKINS] Archiving <https://builds.apache.org/job/UIMA-Ruta%20Java%2011/ws/trunk/ruta-ep-caseditor/target/org.apache.uima.ruta.caseditor_2.7.1.SNAPSHOT.jar>
to org.apache.uima/ruta-ep-caseditor/2.7.1-SNAPSHOT/ruta-ep-caseditor-2.7.1-SNAPSHOT.jar
[JENKINS] Archiving <https://builds.apache.org/job/UIMA-Ruta%20Java%2011/ws/trunk/ruta-basic-type/pom.xml>
to org.apache.uima/ruta-basic-type/2.7.1-SNAPSHOT/ruta-basic-type-2.7.1-SNAPSHOT.pom
[JENKINS] Archiving <https://builds.apache.org/job/UIMA-Ruta%20Java%2011/ws/trunk/ruta-basic-type/target/ruta-basic-type-2.7.1-SNAPSHOT.jar>
to org.apache.uima/ruta-basic-type/2.7.1-SNAPSHOT/ruta-basic-type-2.7.1-SNAPSHOT.jar
[JENKINS] Archiving <https://builds.apache.org/job/UIMA-Ruta%20Java%2011/ws/trunk/ruta-ep-core-ext/pom.xml>
to org.apache.uima/ruta-ep-core-ext/2.7.1-SNAPSHOT/ruta-ep-core-ext-2.7.1-SNAPSHOT.pom
[JENKINS] Archiving <https://builds.apache.org/job/UIMA-Ruta%20Java%2011/ws/trunk/ruta-ep-core-ext/target/org.apache.uima.ruta.core.ext_2.7.1.SNAPSHOT.jar>
to org.apache.uima/ruta-ep-core-ext/2.7.1-SNAPSHOT/ruta-ep-core-ext-2.7.1-SNAPSHOT.jar
[JENKINS] Archiving <https://builds.apache.org/job/UIMA-Ruta%20Java%2011/ws/trunk/ruta-typesystem/pom.xml>
to org.apache.uima/ruta-typesystem/2.7.1-SNAPSHOT/ruta-typesystem-2.7.1-SNAPSHOT.pom
[JENKINS] Archiving <https://builds.apache.org/job/UIMA-Ruta%20Java%2011/ws/trunk/ruta-typesystem/target/ruta-typesystem-2.7.1-SNAPSHOT.jar>
to org.apache.uima/ruta-typesystem/2.7.1-SNAPSHOT/ruta-typesystem-2.7.1-SNAPSHOT.jar
[JENKINS] Archiving <https://builds.apache.org/job/UIMA-Ruta%20Java%2011/ws/trunk/ruta-maven-archetype/pom.xml>
to org.apache.uima/ruta-maven-archetype/2.7.1-SNAPSHOT/ruta-maven-archetype-2.7.1-SNAPSHOT.pom
[Fast Archiver] No prior successful build to compare, so performing full copy of artifacts
[JENKINS] Archiving <https://builds.apache.org/job/UIMA-Ruta%20Java%2011/ws/trunk/ruta-ep-engine/pom.xml>
to org.apache.uima/ruta-ep-engine/2.7.1-SNAPSHOT/ruta-ep-engine-2.7.1-SNAPSHOT.pom
[JENKINS] Archiving <https://builds.apache.org/job/UIMA-Ruta%20Java%2011/ws/trunk/ruta-ep-engine/target/org.apache.uima.ruta.engine_2.7.1.SNAPSHOT.jar>
to org.apache.uima/ruta-ep-engine/2.7.1-SNAPSHOT/ruta-ep-engine-2.7.1-SNAPSHOT.jar
[Fast Archiver] Compressed 7.31 MB of artifacts by 79.1% relative to #11
[JENKINS] Archiving <https://builds.apache.org/job/UIMA-Ruta%20Java%2011/ws/trunk/example-projects/ruta-ep-example-extensions/pom.xml>
to org.apache.uima/ruta-ep-example-extensions/2.7.1-SNAPSHOT/ruta-ep-example-extensions-2.7.1-SNAPSHOT.pom
[Fast Archiver] No prior successful build to compare, so performing full copy of artifacts
[JENKINS] Archiving <https://builds.apache.org/job/UIMA-Ruta%20Java%2011/ws/trunk/pom.xml>
to org.apache.uima/ruta/2.7.1-SNAPSHOT/ruta-2.7.1-SNAPSHOT.pom
[Fast Archiver] No prior successful build to compare, so performing full copy of artifacts
[JENKINS] Archiving <https://builds.apache.org/job/UIMA-Ruta%20Java%2011/ws/trunk/ruta-parent/pom.xml>
to org.apache.uima/ruta-parent/2.7.1-SNAPSHOT/ruta-parent-2.7.1-SNAPSHOT.pom
[JENKINS] Archiving <https://builds.apache.org/job/UIMA-Ruta%20Java%2011/ws/trunk/ruta-ep-ide-ui/pom.xml>
to org.apache.uima/ruta-ep-ide-ui/2.7.1-SNAPSHOT/ruta-ep-ide-ui-2.7.1-SNAPSHOT.pom
[JENKINS] Archiving <https://builds.apache.org/job/UIMA-Ruta%20Java%2011/ws/trunk/ruta-ep-ide-ui/target/org.apache.uima.ruta.ide.ui_2.7.1.SNAPSHOT.jar>
to org.apache.uima/ruta-ep-ide-ui/2.7.1-SNAPSHOT/ruta-ep-ide-ui-2.7.1-SNAPSHOT.jar
[JENKINS] Archiving <https://builds.apache.org/job/UIMA-Ruta%20Java%2011/ws/trunk/ruta-maven-plugin/pom.xml>
to org.apache.uima/ruta-maven-plugin/2.7.1-SNAPSHOT/ruta-maven-plugin-2.7.1-SNAPSHOT.pom
[JENKINS] Archiving <https://builds.apache.org/job/UIMA-Ruta%20Java%2011/ws/trunk/ruta-maven-plugin/target/ruta-maven-plugin-2.7.1-SNAPSHOT.jar>
to org.apache.uima/ruta-maven-plugin/2.7.1-SNAPSHOT/ruta-maven-plugin-2.7.1-SNAPSHOT.jar
[Fast Archiver] No prior successful build to compare, so performing full copy of artifacts
[JENKINS] Archiving <https://builds.apache.org/job/UIMA-Ruta%20Java%2011/ws/trunk/ruta-docbook/pom.xml>
to org.apache.uima/ruta-docbook/2.7.1-SNAPSHOT/ruta-docbook-2.7.1-SNAPSHOT.pom
[Fast Archiver] No prior successful build to compare, so performing full copy of artifacts
Sending e-mails to: dev@uima.apache.org
channel stopped
[WARNINGS] Skipping publisher since build result is FAILURE
[Cobertura] Publishing Cobertura coverage report...


Mime
View raw message