usergrid-commits mailing list archives

Site index · List index
Message view « Date » · « Thread »
Top « Date » · « Thread »
From Apache Jenkins Server <jenk...@builds.apache.org>
Subject Build failed in Jenkins: usergrid-stack #30
Date Fri, 29 Aug 2014 22:05:51 GMT
See <https://builds.apache.org/job/usergrid-stack/30/changes>

Changes:

[rod] Portal - updated grunt to remove old task types

[Dave Johnson] Revert to launcher AppleJavaExtensions 1.4 so that at least the launcher will
build.

------------------------------------------
[...truncated 9726 lines...]
[INFO] Surefire report directory: <https://builds.apache.org/job/usergrid-stack/ws/stack/websocket/target/surefire-reports>

-------------------------------------------------------
 T E S T S
-------------------------------------------------------

-------------------------------------------------------
 T E S T S
-------------------------------------------------------

Results :

Tests run: 0, Failures: 0, Errors: 0, Skipped: 0

[JENKINS] Recording test results
[INFO] 
[INFO] --- maven-jar-plugin:2.4:jar (default-jar) @ usergrid-websocket ---
[INFO] Building jar: <https://builds.apache.org/job/usergrid-stack/ws/stack/websocket/target/usergrid-websocket-1.0.0.jar>
[INFO] 
[INFO] --- maven-site-plugin:3.3:attach-descriptor (attach-descriptor) @ usergrid-websocket
---
[INFO] 
[INFO] --- maven-jar-plugin:2.4:test-jar (test-jar-execution) @ usergrid-websocket ---
[INFO] Building jar: <https://builds.apache.org/job/usergrid-stack/ws/stack/websocket/target/usergrid-websocket-1.0.0-tests.jar>
[INFO] 
[INFO] --- apache-rat-plugin:0.10:check (default) @ usergrid-websocket ---
[INFO] 51 implicit excludes (use -debug for more details).
[INFO] Exclude: **/README.md
[INFO] Exclude: **/CHANGES.txt
[INFO] Exclude: **/*.json
[INFO] Exclude: **/*.log
[INFO] Exclude: **/*.md5
[INFO] Exclude: **/.git/**
[INFO] Exclude: **/.gitignore
[INFO] Exclude: **/.idea/**
[INFO] Exclude: **/*.iml
[INFO] Exclude: **/nbactions.xml
[INFO] Exclude: **/nb-configuration.xml
[INFO] Exclude: **/.classpath/**
[INFO] Exclude: **/.project
[INFO] Exclude: **/.settings/**
[INFO] Exclude: **/logs/**
[INFO] Exclude: **/docs/**
[INFO] Exclude: **/tmp/**
[INFO] Exclude: **/target/**
[INFO] Exclude: **/antlr3/**
[INFO] Exclude: **/META-INF/**
[INFO] Exclude: **/dependency-reduced-pom.xml
[INFO] Exclude: **/**QueryFilter.tokens
[INFO] Exclude: **/**QueryFilterLexer.java
[INFO] Exclude: **/**QueryFilterParser.java
[INFO] Exclude: **/m2/**
[INFO] Exclude: **/*.asc
[INFO] Exclude: **/src/test/resources/**
[INFO] Exclude: **/cloudbees.xml
[INFO] Exclude: **/doc/**
[INFO] Exclude: **/awscluster/**
[INFO] Exclude: **/aws.properties
[INFO] Exclude: **/launcher-vagrant/**
[INFO] Exclude: **/usergrid-custom.properties
[INFO] 11 resources included (use -debug for more details)
[INFO] Rat check: Summary of files. Unapproved: 0 unknown: 0 generated: 0 approved: 10 licence.
[INFO] 
[INFO] --- maven-install-plugin:2.4:install (default-install) @ usergrid-websocket ---
[INFO] Installing <https://builds.apache.org/job/usergrid-stack/ws/stack/websocket/target/usergrid-websocket-1.0.0.jar>
to /home/jenkins/jenkins-slave/maven-repositories/2/org/apache/usergrid/usergrid-websocket/1.0.0/usergrid-websocket-1.0.0.jar
[INFO] Installing <https://builds.apache.org/job/usergrid-stack/ws/stack/websocket/pom.xml>
to /home/jenkins/jenkins-slave/maven-repositories/2/org/apache/usergrid/usergrid-websocket/1.0.0/usergrid-websocket-1.0.0.pom
[INFO] Installing <https://builds.apache.org/job/usergrid-stack/ws/stack/websocket/target/usergrid-websocket-1.0.0-tests.jar>
to /home/jenkins/jenkins-slave/maven-repositories/2/org/apache/usergrid/usergrid-websocket/1.0.0/usergrid-websocket-1.0.0-tests.jar
[INFO]                                                                         
[INFO] ------------------------------------------------------------------------
[INFO] Building Usergrid Launcher 1.0.0
[INFO] ------------------------------------------------------------------------
[INFO] 
[INFO] --- maven-clean-plugin:2.4.1:clean (default-clean) @ usergrid-launcher ---
[INFO] Deleting <https://builds.apache.org/job/usergrid-stack/ws/stack/launcher/target>
[INFO] 
[INFO] --- maven-enforcer-plugin:1.3.1:enforce (enforce-java) @ usergrid-launcher ---
[INFO] 
[INFO] --- maven-remote-resources-plugin:1.2.1:process (default) @ usergrid-launcher ---
[INFO] 
[INFO] --- maven-resources-plugin:2.6:resources (default-resources) @ usergrid-launcher ---
[INFO] Using 'UTF-8' encoding to copy filtered resources.
[INFO] Copying 38 resources
[INFO] Copying 3 resources
[INFO] 
[INFO] --- maven-compiler-plugin:3.1:compile (default-compile) @ usergrid-launcher ---
[INFO] Changes detected - recompiling the module!
[INFO] Compiling 10 source files to <https://builds.apache.org/job/usergrid-stack/ws/stack/launcher/target/classes>
[INFO] -------------------------------------------------------------
[WARNING] COMPILATION WARNING : 
[INFO] -------------------------------------------------------------
[WARNING] bootstrap class path not set in conjunction with -source 1.6
[WARNING] <https://builds.apache.org/job/usergrid-stack/ws/stack/launcher/src/main/java/org/apache/usergrid/launcher/LauncherFrame.java>:
<https://builds.apache.org/job/usergrid-stack/ws/stack/launcher/src/main/java/org/apache/usergrid/launcher/LauncherFrame.java>
uses unchecked or unsafe operations.
[WARNING] <https://builds.apache.org/job/usergrid-stack/ws/stack/launcher/src/main/java/org/apache/usergrid/launcher/LauncherFrame.java>:
Recompile with -Xlint:unchecked for details.
[INFO] 3 warnings 
[INFO] -------------------------------------------------------------
[INFO] -------------------------------------------------------------
[ERROR] COMPILATION ERROR : 
[INFO] -------------------------------------------------------------
[ERROR] <https://builds.apache.org/job/usergrid-stack/ws/stack/launcher/src/main/java/org/apache/usergrid/launcher/AppleUtils.java>:[30,51]
cannot find symbol
  symbol:   class AboutHandler
  location: package com.apple.eawt
[INFO] 1 error
[INFO] -------------------------------------------------------------
[INFO] ------------------------------------------------------------------------
[INFO] Reactor Summary:
[INFO] 
[INFO] Usergrid Parent ................................... SUCCESS [59.357s]
[INFO] Usergrid Java SDK 0.0.3 ........................... SUCCESS [12.225s]
[INFO] Usergrid Build Tools .............................. SUCCESS [5.935s]
[INFO] Usergrid Config ................................... SUCCESS [3.653s]
[INFO] Usergrid Test Utils ............................... SUCCESS [32.454s]
[INFO] Usergrid Core ..................................... SUCCESS [6:21.335s]
[INFO] Usergrid Services ................................. SUCCESS [1:18.140s]
[INFO] Usergrid MongoDB Emulator ......................... SUCCESS [9.026s]
[INFO] Usergrid REST ..................................... SUCCESS [8:32.775s]
[INFO] Usergrid Tools .................................... SUCCESS [47.981s]
[INFO] Usergrid Websocket ................................ SUCCESS [11.877s]
[INFO] Usergrid Launcher ................................. FAILURE [9.319s]
[INFO] ------------------------------------------------------------------------
[INFO] BUILD FAILURE
[INFO] ------------------------------------------------------------------------
[INFO] Total time: 19:58.603s
[INFO] Finished at: Fri Aug 29 22:04:13 UTC 2014
[INFO] Final Memory: 71M/431M
[INFO] ------------------------------------------------------------------------
Waiting for Jenkins to finish collecting data
[ERROR] Failed to execute goal org.apache.maven.plugins:maven-compiler-plugin:3.1:compile
(default-compile) on project usergrid-launcher: Compilation failure
[ERROR] <https://builds.apache.org/job/usergrid-stack/ws/stack/launcher/src/main/java/org/apache/usergrid/launcher/AppleUtils.java>:[30,51]
cannot find symbol
[ERROR] symbol:   class AboutHandler
[ERROR] location: package com.apple.eawt
[ERROR] -> [Help 1]
[ERROR] 
[ERROR] To see the full stack trace of the errors, re-run Maven with the -e switch.
[ERROR] Re-run Maven using the -X switch to enable full debug logging.
[ERROR] 
[ERROR] For more information about the errors and possible solutions, please read the following
articles:
[ERROR] [Help 1] http://cwiki.apache.org/confluence/display/MAVEN/MojoFailureException
[ERROR] 
[ERROR] After correcting the problems, you can resume the build with the command
[ERROR]   mvn <goals> -rf :usergrid-launcher
[JENKINS] Archiving <https://builds.apache.org/job/usergrid-stack/ws/stack/build-tools/pom.xml>
to org.apache.usergrid/build-tools/1.0.0/build-tools-1.0.0.pom
[JENKINS] Archiving <https://builds.apache.org/job/usergrid-stack/ws/stack/build-tools/target/build-tools-1.0.0.jar>
to org.apache.usergrid/build-tools/1.0.0/build-tools-1.0.0.jar
[JENKINS] Archiving <https://builds.apache.org/job/usergrid-stack/ws/stack/build-tools/target/build-tools-1.0.0-tests.jar>
to org.apache.usergrid/build-tools/1.0.0/build-tools-1.0.0-tests.jar
Sending artifact delta relative to usergrid-stack ? Usergrid Build Tools #29
Archived 3 artifacts
Archive block size is 32768
Received 0 blocks and 18911 bytes
Compression is 0.0%
Took 0.1 sec
[JENKINS] Archiving <https://builds.apache.org/job/usergrid-stack/ws/stack/websocket/pom.xml>
to org.apache.usergrid/usergrid-websocket/1.0.0/usergrid-websocket-1.0.0.pom
[JENKINS] Archiving <https://builds.apache.org/job/usergrid-stack/ws/stack/websocket/target/usergrid-websocket-1.0.0.jar>
to org.apache.usergrid/usergrid-websocket/1.0.0/usergrid-websocket-1.0.0.jar
[JENKINS] Archiving <https://builds.apache.org/job/usergrid-stack/ws/stack/websocket/target/usergrid-websocket-1.0.0-tests.jar>
to org.apache.usergrid/usergrid-websocket/1.0.0/usergrid-websocket-1.0.0-tests.jar
Sending artifact delta relative to usergrid-stack ? Usergrid Websocket #29
Archived 3 artifacts
Archive block size is 32768
Received 0 blocks and 51927 bytes
Compression is 0.0%
Took 0.12 sec
[JENKINS] Archiving <https://builds.apache.org/job/usergrid-stack/ws/stack/services/pom.xml>
to org.apache.usergrid/usergrid-services/1.0.0/usergrid-services-1.0.0.pom
[JENKINS] Archiving <https://builds.apache.org/job/usergrid-stack/ws/stack/services/target/usergrid-services-1.0.0.jar>
to org.apache.usergrid/usergrid-services/1.0.0/usergrid-services-1.0.0.jar
[JENKINS] Archiving <https://builds.apache.org/job/usergrid-stack/ws/stack/services/target/usergrid-services-1.0.0-tests.jar>
to org.apache.usergrid/usergrid-services/1.0.0/usergrid-services-1.0.0-tests.jar
Sending artifact delta relative to usergrid-stack ? Usergrid Services #29
Archived 3 artifacts
Archive block size is 32768
Received 0 blocks and 421922 bytes
Compression is 0.0%
Took 2.2 sec
[JENKINS] Archiving <https://builds.apache.org/job/usergrid-stack/ws/stack/pom.xml>
to org.apache.usergrid/usergrid/1.0.0/usergrid-1.0.0.pom
[JENKINS] Archiving <https://builds.apache.org/job/usergrid-stack/ws/stack/target/usergrid-1.0.0-tests.jar>
to org.apache.usergrid/usergrid/1.0.0/usergrid-1.0.0-tests.jar
Sending artifact delta relative to usergrid-stack ? Usergrid Parent #29
Archived 2 artifacts
Archive block size is 32768
Received 0 blocks and 67152 bytes
Compression is 0.0%
Took 0.17 sec
[JENKINS] Archiving <https://builds.apache.org/job/usergrid-stack/ws/stack/config/pom.xml>
to org.apache.usergrid/usergrid-config/1.0.0/usergrid-config-1.0.0.pom
[JENKINS] Archiving <https://builds.apache.org/job/usergrid-stack/ws/stack/config/target/usergrid-config-1.0.0.jar>
to org.apache.usergrid/usergrid-config/1.0.0/usergrid-config-1.0.0.jar
[JENKINS] Archiving <https://builds.apache.org/job/usergrid-stack/ws/stack/config/target/usergrid-config-1.0.0-tests.jar>
to org.apache.usergrid/usergrid-config/1.0.0/usergrid-config-1.0.0-tests.jar
Sending artifact delta relative to usergrid-stack ? Usergrid Config #29
Archived 3 artifacts
Archive block size is 32768
Received 0 blocks and 39133 bytes
Compression is 0.0%
Took 2.4 sec
[JENKINS] Archiving <https://builds.apache.org/job/usergrid-stack/ws/stack/launcher/pom.xml>
to org.apache.usergrid/usergrid-launcher/1.0.0/usergrid-launcher-1.0.0.pom
Sending artifact delta relative to usergrid-stack ? Usergrid Launcher #29
Archived 1 artifacts
Archive block size is 32768
Received 0 blocks and 7825 bytes
Compression is 0.0%
Took 3.2 sec
[JENKINS] Archiving <https://builds.apache.org/job/usergrid-stack/ws/stack/test-utils/pom.xml>
to org.apache.usergrid/usergrid-test-utils/1.0.0/usergrid-test-utils-1.0.0.pom
[JENKINS] Archiving <https://builds.apache.org/job/usergrid-stack/ws/stack/test-utils/target/usergrid-test-utils-1.0.0.jar>
to org.apache.usergrid/usergrid-test-utils/1.0.0/usergrid-test-utils-1.0.0.jar
[JENKINS] Archiving <https://builds.apache.org/job/usergrid-stack/ws/stack/test-utils/target/usergrid-test-utils-1.0.0-tests.jar>
to org.apache.usergrid/usergrid-test-utils/1.0.0/usergrid-test-utils-1.0.0-tests.jar
Sending artifact delta relative to usergrid-stack ? Usergrid Test Utils #29
Archived 3 artifacts
Archive block size is 32768
Received 0 blocks and 71871 bytes
Compression is 0.0%
Took 0.22 sec
[JENKINS] Archiving <https://builds.apache.org/job/usergrid-stack/ws/stack/core/pom.xml>
to org.apache.usergrid/usergrid-core/1.0.0/usergrid-core-1.0.0.pom
[JENKINS] Archiving <https://builds.apache.org/job/usergrid-stack/ws/stack/core/target/usergrid-core-1.0.0.jar>
to org.apache.usergrid/usergrid-core/1.0.0/usergrid-core-1.0.0.jar
[JENKINS] Archiving <https://builds.apache.org/job/usergrid-stack/ws/stack/core/target/usergrid-core-1.0.0-tests.jar>
to org.apache.usergrid/usergrid-core/1.0.0/usergrid-core-1.0.0-tests.jar
Sending artifact delta relative to usergrid-stack ? Usergrid Core #29
Archived 3 artifacts
Archive block size is 32768
Received 0 blocks and 1003815 bytes
Compression is 0.0%
Took 2.5 sec
[JENKINS] Archiving <https://builds.apache.org/job/usergrid-stack/ws/stack/rest/pom.xml>
to org.apache.usergrid/usergrid-rest/1.0.0/usergrid-rest-1.0.0.pom
[JENKINS] Archiving <https://builds.apache.org/job/usergrid-stack/ws/stack/rest/target/ROOT.war>
to org.apache.usergrid/usergrid-rest/1.0.0/usergrid-rest-1.0.0.war
[JENKINS] Archiving <https://builds.apache.org/job/usergrid-stack/ws/stack/rest/target/usergrid-rest-1.0.0-tests.jar>
to org.apache.usergrid/usergrid-rest/1.0.0/usergrid-rest-1.0.0-tests.jar
[JENKINS] Archiving <https://builds.apache.org/job/usergrid-stack/ws/stack/rest/target/usergrid-rest-1.0.0-classes.jar>
to org.apache.usergrid/usergrid-rest/1.0.0/usergrid-rest-1.0.0-classes.jar
[JENKINS] Archiving <https://builds.apache.org/job/usergrid-stack/ws/stack/rest/target/usergrid-rest-1.0.0-compiled-jsp.jar>
to org.apache.usergrid/usergrid-rest/1.0.0/usergrid-rest-1.0.0-compiled-jsp.jar
Sending artifact delta relative to usergrid-stack ? Usergrid REST #29
Archived 5 artifacts
Archive block size is 32768
Received 1341 blocks and 2342727 bytes
Compression is 94.9%
Took 8.2 sec
[JENKINS] Archiving <https://builds.apache.org/job/usergrid-stack/ws/stack/mongo-emulator/pom.xml>
to org.apache.usergrid/usergrid-mongo-emulator/1.0.0/usergrid-mongo-emulator-1.0.0.pom
[JENKINS] Archiving <https://builds.apache.org/job/usergrid-stack/ws/stack/mongo-emulator/target/usergrid-mongo-emulator-1.0.0.jar>
to org.apache.usergrid/usergrid-mongo-emulator/1.0.0/usergrid-mongo-emulator-1.0.0.jar
[JENKINS] Archiving <https://builds.apache.org/job/usergrid-stack/ws/stack/mongo-emulator/target/usergrid-mongo-emulator-1.0.0-tests.jar>
to org.apache.usergrid/usergrid-mongo-emulator/1.0.0/usergrid-mongo-emulator-1.0.0-tests.jar
Sending artifact delta relative to usergrid-stack ? Usergrid MongoDB Emulator #29
Archived 3 artifacts
Archive block size is 32768
Received 0 blocks and 106209 bytes
Compression is 0.0%
Took 0.19 sec
[JENKINS] Archiving <https://builds.apache.org/job/usergrid-stack/ws/stack/tools/pom.xml>
to org.apache.usergrid/usergrid-tools/1.0.0/usergrid-tools-1.0.0.pom
[JENKINS] Archiving <https://builds.apache.org/job/usergrid-stack/ws/stack/tools/target/usergrid-tools-1.0.0.jar>
to org.apache.usergrid/usergrid-tools/1.0.0/usergrid-tools-1.0.0.jar
[JENKINS] Archiving <https://builds.apache.org/job/usergrid-stack/ws/stack/tools/target/usergrid-tools-1.0.0-tests.jar>
to org.apache.usergrid/usergrid-tools/1.0.0/usergrid-tools-1.0.0-tests.jar
[JENKINS] Archiving <https://builds.apache.org/job/usergrid-stack/ws/stack/tools/target/usergrid-tools-1.0.0-release.tar.gz>
to org.apache.usergrid/usergrid-tools/1.0.0/usergrid-tools-1.0.0-release.tar.gz
Sending artifact delta relative to usergrid-stack ? Usergrid Tools #29
Archived 4 artifacts
Archive block size is 32768
Received 1301 blocks and 43506472 bytes
Compression is 49.5%
Took 38 sec
[JENKINS] Archiving <https://builds.apache.org/job/usergrid-stack/ws/stack/java-sdk-old/pom.xml>
to org.usergrid/usergrid-java-client/0.0.3/usergrid-java-client-0.0.3.pom
[JENKINS] Archiving <https://builds.apache.org/job/usergrid-stack/ws/stack/java-sdk-old/target/usergrid-java-client-0.0.3.jar>
to org.usergrid/usergrid-java-client/0.0.3/usergrid-java-client-0.0.3.jar
[JENKINS] Archiving <https://builds.apache.org/job/usergrid-stack/ws/stack/java-sdk-old/target/usergrid-java-client-0.0.3-tests.jar>
to org.usergrid/usergrid-java-client/0.0.3/usergrid-java-client-0.0.3-tests.jar
Sending artifact delta relative to usergrid-stack ? Usergrid Java SDK 0.0.3 #29
Archived 3 artifacts
Archive block size is 32768
Received 0 blocks and 63275 bytes
Compression is 0.0%
Took 0.41 sec
Sending e-mails to: commits@usergrid.incubator.apache.org
channel stopped

Mime
View raw message