usergrid-commits mailing list archives

Site index · List index
Message view « Date » · « Thread »
Top « Date » · « Thread »
From Apache Jenkins Server <jenk...@builds.apache.org>
Subject Build failed in Jenkins: usergrid-stack #25
Date Tue, 26 Aug 2014 13:00:52 GMT
See <https://builds.apache.org/job/usergrid-stack/25/changes>

Changes:

[Dave Johnson] Remove all jars from our source code directories.

[Dave Johnson] Add disclaimer file.

[Dave Johnson] Add ASF header to many files.

[Dave Johnson] Add the old 0.0.6 Java SDK code because the Android SDK needs it.

------------------------------------------
[...truncated 26165 lines...]
[INFO] Exclude: **/aws.properties
[INFO] Exclude: **/launcher-vagrant/**
[INFO] Exclude: **/usergrid-custom.properties
[INFO] 11 resources included (use -debug for more details)
[INFO] Rat check: Summary of files. Unapproved: 0 unknown: 0 generated: 0 approved: 10 licence.
[INFO] 
[INFO] --- maven-install-plugin:2.4:install (default-install) @ usergrid-websocket ---
[INFO] Installing <https://builds.apache.org/job/usergrid-stack/ws/stack/websocket/target/usergrid-websocket-1.0.0.jar>
to /home/jenkins/jenkins-slave/maven-repositories/2/org/apache/usergrid/usergrid-websocket/1.0.0/usergrid-websocket-1.0.0.jar
[INFO] Installing <https://builds.apache.org/job/usergrid-stack/ws/stack/websocket/pom.xml>
to /home/jenkins/jenkins-slave/maven-repositories/2/org/apache/usergrid/usergrid-websocket/1.0.0/usergrid-websocket-1.0.0.pom
[INFO] Installing <https://builds.apache.org/job/usergrid-stack/ws/stack/websocket/target/usergrid-websocket-1.0.0-tests.jar>
to /home/jenkins/jenkins-slave/maven-repositories/2/org/apache/usergrid/usergrid-websocket/1.0.0/usergrid-websocket-1.0.0-tests.jar
[INFO]                                                                         
[INFO] ------------------------------------------------------------------------
[INFO] Building Usergrid Launcher 1.0.0
[INFO] ------------------------------------------------------------------------
Downloading: file://<https://builds.apache.org/job/usergrid-stack/ws/stack/launcher/../m2/repository/org/apache/tomcat/jasper/6.0.33/jasper-6.0.33.pom>
Downloading: http://repo.maven.apache.org/maven2/org/apache/tomcat/jasper/6.0.33/jasper-6.0.33.pom
[INFO] I/O exception (org.apache.maven.wagon.providers.http.httpclient.NoHttpResponseException)
caught when processing request: The target server failed to respond
[INFO] Retrying request
Downloaded: http://repo.maven.apache.org/maven2/org/apache/tomcat/jasper/6.0.33/jasper-6.0.33.pom
(3 KB at 11.7 KB/sec)
Downloading: file://<https://builds.apache.org/job/usergrid-stack/ws/stack/launcher/../m2/repository/org/apache/tomcat/jsp-api/6.0.33/jsp-api-6.0.33.pom>
Downloading: http://repo.maven.apache.org/maven2/org/apache/tomcat/jsp-api/6.0.33/jsp-api-6.0.33.pom
Downloaded: http://repo.maven.apache.org/maven2/org/apache/tomcat/jsp-api/6.0.33/jsp-api-6.0.33.pom
(2 KB at 19.0 KB/sec)
Downloading: file://<https://builds.apache.org/job/usergrid-stack/ws/stack/launcher/../m2/repository/org/apache/tomcat/el-api/6.0.33/el-api-6.0.33.pom>
Downloading: http://repo.maven.apache.org/maven2/org/apache/tomcat/el-api/6.0.33/el-api-6.0.33.pom
Downloaded: http://repo.maven.apache.org/maven2/org/apache/tomcat/el-api/6.0.33/el-api-6.0.33.pom
(2 KB at 14.0 KB/sec)
Downloading: file://<https://builds.apache.org/job/usergrid-stack/ws/stack/launcher/../m2/repository/org/apache/tomcat/catalina/6.0.29/catalina-6.0.29.pom>
Downloading: http://repo.maven.apache.org/maven2/org/apache/tomcat/catalina/6.0.29/catalina-6.0.29.pom
Downloaded: http://repo.maven.apache.org/maven2/org/apache/tomcat/catalina/6.0.29/catalina-6.0.29.pom
(2 KB at 24.8 KB/sec)
Downloading: file://<https://builds.apache.org/job/usergrid-stack/ws/stack/launcher/../m2/repository/org/apache/tomcat/annotations-api/6.0.29/annotations-api-6.0.29.pom>
Downloading: http://repo.maven.apache.org/maven2/org/apache/tomcat/annotations-api/6.0.29/annotations-api-6.0.29.pom
Downloaded: http://repo.maven.apache.org/maven2/org/apache/tomcat/annotations-api/6.0.29/annotations-api-6.0.29.pom
(2 KB at 14.0 KB/sec)
Downloading: file://<https://builds.apache.org/job/usergrid-stack/ws/stack/launcher/../m2/repository/org/eclipse/jdt/core/compiler/ecj/3.3.1/ecj-3.3.1.pom>
Downloading: http://repo.maven.apache.org/maven2/org/eclipse/jdt/core/compiler/ecj/3.3.1/ecj-3.3.1.pom
Downloaded: http://repo.maven.apache.org/maven2/org/eclipse/jdt/core/compiler/ecj/3.3.1/ecj-3.3.1.pom
(2 KB at 20.4 KB/sec)
Downloading: file://<https://builds.apache.org/job/usergrid-stack/ws/stack/launcher/../m2/repository/org/apache/tomcat/jasper-el/6.0.33/jasper-el-6.0.33.pom>
Downloading: http://repo.maven.apache.org/maven2/org/apache/tomcat/jasper-el/6.0.33/jasper-el-6.0.33.pom
Downloaded: http://repo.maven.apache.org/maven2/org/apache/tomcat/jasper-el/6.0.33/jasper-el-6.0.33.pom
(2 KB at 9.0 KB/sec)
Downloading: file://<https://builds.apache.org/job/usergrid-stack/ws/stack/launcher/../m2/repository/com/sun/jersey/jersey-grizzly2/1.18/jersey-grizzly2-1.18.pom>
Downloading: http://repo.maven.apache.org/maven2/com/sun/jersey/jersey-grizzly2/1.18/jersey-grizzly2-1.18.pom
Downloaded: http://repo.maven.apache.org/maven2/com/sun/jersey/jersey-grizzly2/1.18/jersey-grizzly2-1.18.pom
(8 KB at 96.2 KB/sec)
Downloading: file://<https://builds.apache.org/job/usergrid-stack/ws/stack/launcher/../m2/repository/org/glassfish/grizzly/grizzly-http-servlet-server/2.1.2/grizzly-http-servlet-server-2.1.2.pom>
Downloading: http://repo.maven.apache.org/maven2/org/glassfish/grizzly/grizzly-http-servlet-server/2.1.2/grizzly-http-servlet-server-2.1.2.pom
Downloaded: http://repo.maven.apache.org/maven2/org/glassfish/grizzly/grizzly-http-servlet-server/2.1.2/grizzly-http-servlet-server-2.1.2.pom
(7 KB at 86.4 KB/sec)
Downloading: file://<https://builds.apache.org/job/usergrid-stack/ws/stack/launcher/../m2/repository/org/glassfish/grizzly/grizzly-http-server-core/2.1.2/grizzly-http-server-core-2.1.2.pom>
Downloading: http://repo.maven.apache.org/maven2/org/glassfish/grizzly/grizzly-http-server-core/2.1.2/grizzly-http-server-core-2.1.2.pom
Downloaded: http://repo.maven.apache.org/maven2/org/glassfish/grizzly/grizzly-http-server-core/2.1.2/grizzly-http-server-core-2.1.2.pom
(7 KB at 90.1 KB/sec)
Downloading: file://<https://builds.apache.org/job/usergrid-stack/ws/stack/launcher/../m2/repository/org/glassfish/grizzly/grizzly-core/2.1.2/grizzly-core-2.1.2.pom>
Downloading: http://repo.maven.apache.org/maven2/org/glassfish/grizzly/grizzly-core/2.1.2/grizzly-core-2.1.2.pom
Downloaded: http://repo.maven.apache.org/maven2/org/glassfish/grizzly/grizzly-core/2.1.2/grizzly-core-2.1.2.pom
(7 KB at 88.1 KB/sec)
Downloading: file://<https://builds.apache.org/job/usergrid-stack/ws/stack/launcher/../m2/repository/org/glassfish/grizzly/grizzly-portunif/2.1.2/grizzly-portunif-2.1.2.pom>
Downloading: http://repo.maven.apache.org/maven2/org/glassfish/grizzly/grizzly-portunif/2.1.2/grizzly-portunif-2.1.2.pom
Downloaded: http://repo.maven.apache.org/maven2/org/glassfish/grizzly/grizzly-portunif/2.1.2/grizzly-portunif-2.1.2.pom
(4 KB at 52.5 KB/sec)
Downloading: file://<https://builds.apache.org/job/usergrid-stack/ws/stack/launcher/../m2/repository/org/glassfish/grizzly/grizzly-http-ajp/2.1.2/grizzly-http-ajp-2.1.2.pom>
Downloading: http://repo.maven.apache.org/maven2/org/glassfish/grizzly/grizzly-http-ajp/2.1.2/grizzly-http-ajp-2.1.2.pom
Downloaded: http://repo.maven.apache.org/maven2/org/glassfish/grizzly/grizzly-http-ajp/2.1.2/grizzly-http-ajp-2.1.2.pom
(5 KB at 55.7 KB/sec)
Downloading: file://<https://builds.apache.org/job/usergrid-stack/ws/stack/launcher/../m2/repository/org/glassfish/grizzly/grizzly-http-server-multipart/2.1.2/grizzly-http-server-multipart-2.1.2.pom>
Downloading: http://repo.maven.apache.org/maven2/org/glassfish/grizzly/grizzly-http-server-multipart/2.1.2/grizzly-http-server-multipart-2.1.2.pom
Downloaded: http://repo.maven.apache.org/maven2/org/glassfish/grizzly/grizzly-http-server-multipart/2.1.2/grizzly-http-server-multipart-2.1.2.pom
(6 KB at 28.6 KB/sec)
Downloading: file://<https://builds.apache.org/job/usergrid-stack/ws/stack/launcher/../m2/repository/com/apple/AppleJavaExtensions/1.5.4/AppleJavaExtensions-1.5.4.pom>
Downloading: http://repo.maven.apache.org/maven2/com/apple/AppleJavaExtensions/1.5.4/AppleJavaExtensions-1.5.4.pom
[WARNING] The POM for com.apple:AppleJavaExtensions:jar:1.5.4 is missing, no dependency information
available
Downloading: file://<https://builds.apache.org/job/usergrid-stack/ws/stack/launcher/../m2/repository/org/apache/tomcat/jasper/6.0.33/jasper-6.0.33.jar>
Downloading: file://<https://builds.apache.org/job/usergrid-stack/ws/stack/launcher/../m2/repository/org/apache/tomcat/jsp-api/6.0.33/jsp-api-6.0.33.jar>
Downloading: file://<https://builds.apache.org/job/usergrid-stack/ws/stack/launcher/../m2/repository/org/apache/tomcat/catalina/6.0.29/catalina-6.0.29.jar>
Downloading: file://<https://builds.apache.org/job/usergrid-stack/ws/stack/launcher/../m2/repository/org/apache/tomcat/annotations-api/6.0.29/annotations-api-6.0.29.jar>
Downloading: file://<https://builds.apache.org/job/usergrid-stack/ws/stack/launcher/../m2/repository/org/apache/tomcat/el-api/6.0.33/el-api-6.0.33.jar>
Downloading: file://<https://builds.apache.org/job/usergrid-stack/ws/stack/launcher/../m2/repository/org/eclipse/jdt/core/compiler/ecj/3.3.1/ecj-3.3.1.jar>
Downloading: file://<https://builds.apache.org/job/usergrid-stack/ws/stack/launcher/../m2/repository/org/glassfish/grizzly/grizzly-http-server-core/2.1.2/grizzly-http-server-core-2.1.2.jar>
Downloading: file://<https://builds.apache.org/job/usergrid-stack/ws/stack/launcher/../m2/repository/org/glassfish/grizzly/grizzly-http-servlet-server/2.1.2/grizzly-http-servlet-server-2.1.2.jar>
Downloading: file://<https://builds.apache.org/job/usergrid-stack/ws/stack/launcher/../m2/repository/com/sun/jersey/jersey-grizzly2/1.18/jersey-grizzly2-1.18.jar>
Downloading: file://<https://builds.apache.org/job/usergrid-stack/ws/stack/launcher/../m2/repository/org/apache/tomcat/jasper-el/6.0.33/jasper-el-6.0.33.jar>
Downloading: file://<https://builds.apache.org/job/usergrid-stack/ws/stack/launcher/../m2/repository/org/glassfish/grizzly/grizzly-core/2.1.2/grizzly-core-2.1.2.jar>
Downloading: file://<https://builds.apache.org/job/usergrid-stack/ws/stack/launcher/../m2/repository/org/glassfish/grizzly/grizzly-portunif/2.1.2/grizzly-portunif-2.1.2.jar>
Downloading: file://<https://builds.apache.org/job/usergrid-stack/ws/stack/launcher/../m2/repository/org/glassfish/grizzly/grizzly-http-ajp/2.1.2/grizzly-http-ajp-2.1.2.jar>
Downloading: file://<https://builds.apache.org/job/usergrid-stack/ws/stack/launcher/../m2/repository/org/glassfish/grizzly/grizzly-http-server-multipart/2.1.2/grizzly-http-server-multipart-2.1.2.jar>
Downloading: file://<https://builds.apache.org/job/usergrid-stack/ws/stack/launcher/../m2/repository/com/apple/AppleJavaExtensions/1.5.4/AppleJavaExtensions-1.5.4.jar>
Downloading: http://repo.maven.apache.org/maven2/org/apache/tomcat/jasper/6.0.33/jasper-6.0.33.jar
Downloading: http://repo.maven.apache.org/maven2/org/apache/tomcat/jsp-api/6.0.33/jsp-api-6.0.33.jar
Downloading: http://repo.maven.apache.org/maven2/org/apache/tomcat/catalina/6.0.29/catalina-6.0.29.jar
Downloading: http://repo.maven.apache.org/maven2/org/apache/tomcat/annotations-api/6.0.29/annotations-api-6.0.29.jar
Downloading: http://repo.maven.apache.org/maven2/org/apache/tomcat/el-api/6.0.33/el-api-6.0.33.jar
Downloaded: http://repo.maven.apache.org/maven2/org/apache/tomcat/annotations-api/6.0.29/annotations-api-6.0.29.jar
(15 KB at 99.9 KB/sec)
Downloading: http://repo.maven.apache.org/maven2/org/eclipse/jdt/core/compiler/ecj/3.3.1/ecj-3.3.1.jar
Downloaded: http://repo.maven.apache.org/maven2/org/apache/tomcat/el-api/6.0.33/el-api-6.0.33.jar
(33 KB at 218.5 KB/sec)
Downloading: http://repo.maven.apache.org/maven2/org/apache/tomcat/jasper-el/6.0.33/jasper-el-6.0.33.jar
Downloaded: http://repo.maven.apache.org/maven2/org/apache/tomcat/jsp-api/6.0.33/jsp-api-6.0.33.jar
(75 KB at 351.6 KB/sec)
Downloading: http://repo.maven.apache.org/maven2/com/sun/jersey/jersey-grizzly2/1.18/jersey-grizzly2-1.18.jar
Downloaded: http://repo.maven.apache.org/maven2/com/sun/jersey/jersey-grizzly2/1.18/jersey-grizzly2-1.18.jar
(16 KB at 213.8 KB/sec)
Downloading: http://repo.maven.apache.org/maven2/org/glassfish/grizzly/grizzly-http-servlet-server/2.1.2/grizzly-http-servlet-server-2.1.2.jar
Downloaded: http://repo.maven.apache.org/maven2/org/apache/tomcat/jasper-el/6.0.33/jasper-el-6.0.33.jar
(110 KB at 607.3 KB/sec)
Downloading: http://repo.maven.apache.org/maven2/org/glassfish/grizzly/grizzly-http-server-core/2.1.2/grizzly-http-server-core-2.1.2.jar
Downloaded: http://repo.maven.apache.org/maven2/org/apache/tomcat/jasper/6.0.33/jasper-6.0.33.jar
(516 KB at 1120.0 KB/sec)
Downloading: http://repo.maven.apache.org/maven2/org/glassfish/grizzly/grizzly-core/2.1.2/grizzly-core-2.1.2.jar
Downloaded: http://repo.maven.apache.org/maven2/org/apache/tomcat/catalina/6.0.29/catalina-6.0.29.jar
(1164 KB at 1867.0 KB/sec)
Downloading: http://repo.maven.apache.org/maven2/org/glassfish/grizzly/grizzly-portunif/2.1.2/grizzly-portunif-2.1.2.jar
Downloaded: http://repo.maven.apache.org/maven2/org/glassfish/grizzly/grizzly-portunif/2.1.2/grizzly-portunif-2.1.2.jar
(17 KB at 216.2 KB/sec)
Downloading: http://repo.maven.apache.org/maven2/org/glassfish/grizzly/grizzly-http-ajp/2.1.2/grizzly-http-ajp-2.1.2.jar
Downloaded: http://repo.maven.apache.org/maven2/org/glassfish/grizzly/grizzly-core/2.1.2/grizzly-core-2.1.2.jar
(690 KB at 2704.7 KB/sec)
Downloading: http://repo.maven.apache.org/maven2/org/glassfish/grizzly/grizzly-http-server-multipart/2.1.2/grizzly-http-server-multipart-2.1.2.jar
Downloaded: http://repo.maven.apache.org/maven2/org/glassfish/grizzly/grizzly-http-ajp/2.1.2/grizzly-http-ajp-2.1.2.jar
(25 KB at 333.0 KB/sec)
Downloading: http://repo.maven.apache.org/maven2/com/apple/AppleJavaExtensions/1.5.4/AppleJavaExtensions-1.5.4.jar
Downloaded: http://repo.maven.apache.org/maven2/org/glassfish/grizzly/grizzly-http-server-multipart/2.1.2/grizzly-http-server-multipart-2.1.2.jar
(27 KB at 346.1 KB/sec)
Downloaded: http://repo.maven.apache.org/maven2/org/glassfish/grizzly/grizzly-http-server-core/2.1.2/grizzly-http-server-core-2.1.2.jar
(1167 KB at 2332.4 KB/sec)
Downloaded: http://repo.maven.apache.org/maven2/org/glassfish/grizzly/grizzly-http-servlet-server/2.1.2/grizzly-http-servlet-server-2.1.2.jar
(1431 KB at 2568.6 KB/sec)
Downloaded: http://repo.maven.apache.org/maven2/org/eclipse/jdt/core/compiler/ecj/3.3.1/ecj-3.3.1.jar
(1528 KB at 2149.0 KB/sec)
[INFO] ------------------------------------------------------------------------
[INFO] Reactor Summary:
[INFO] 
[INFO] Usergrid Parent ................................... SUCCESS [32.448s]
[INFO] Usergrid Java SDK 0.0.3 ........................... SUCCESS [8.833s]
[INFO] Usergrid Build Tools .............................. SUCCESS [5.021s]
[INFO] Usergrid Config ................................... SUCCESS [2.968s]
[INFO] Usergrid Test Utils ............................... SUCCESS [21.567s]
[INFO] Usergrid Core ..................................... SUCCESS [4:57.207s]
[INFO] Usergrid Services ................................. SUCCESS [1:12.520s]
[INFO] Usergrid MongoDB Emulator ......................... SUCCESS [8.867s]
[INFO] Usergrid REST ..................................... SUCCESS [5:41.075s]
[INFO] Usergrid Tools .................................... SUCCESS [43.832s]
[INFO] Usergrid Websocket ................................ SUCCESS [9.576s]
[INFO] Usergrid Launcher ................................. FAILURE [2.627s]
[INFO] ------------------------------------------------------------------------
[INFO] BUILD FAILURE
[INFO] ------------------------------------------------------------------------
[INFO] Total time: 14:28.915s
[INFO] Finished at: Tue Aug 26 12:59:12 UTC 2014
[INFO] Final Memory: 78M/432M
[INFO] ------------------------------------------------------------------------
Waiting for Jenkins to finish collecting data
[ERROR] Failed to execute goal on project usergrid-launcher: Could not resolve dependencies
for project org.apache.usergrid:usergrid-launcher:jar:1.0.0: Could not find artifact com.apple:AppleJavaExtensions:jar:1.5.4
in local-dependencies (file://<https://builds.apache.org/job/usergrid-stack/ws/stack/launcher/../m2/repository)>
-> [Help 1]
[ERROR] 
[ERROR] To see the full stack trace of the errors, re-run Maven with the -e switch.
[ERROR] Re-run Maven using the -X switch to enable full debug logging.
[ERROR] 
[ERROR] For more information about the errors and possible solutions, please read the following
articles:
[ERROR] [Help 1] http://cwiki.apache.org/confluence/display/MAVEN/DependencyResolutionException
[ERROR] 
[ERROR] After correcting the problems, you can resume the build with the command
[ERROR]   mvn <goals> -rf :usergrid-launcher
[JENKINS] Archiving <https://builds.apache.org/job/usergrid-stack/ws/stack/build-tools/pom.xml>
to org.apache.usergrid/build-tools/1.0.0/build-tools-1.0.0.pom
[JENKINS] Archiving <https://builds.apache.org/job/usergrid-stack/ws/stack/build-tools/target/build-tools-1.0.0.jar>
to org.apache.usergrid/build-tools/1.0.0/build-tools-1.0.0.jar
[JENKINS] Archiving <https://builds.apache.org/job/usergrid-stack/ws/stack/build-tools/target/build-tools-1.0.0-tests.jar>
to org.apache.usergrid/build-tools/1.0.0/build-tools-1.0.0-tests.jar
Sending artifact delta relative to usergrid-stack ? Usergrid Build Tools #24
Archived 3 artifacts
Archive block size is 32768
Received 0 blocks and 18909 bytes
Compression is 0.0%
Took 0.17 sec
[JENKINS] Archiving <https://builds.apache.org/job/usergrid-stack/ws/stack/websocket/pom.xml>
to org.apache.usergrid/usergrid-websocket/1.0.0/usergrid-websocket-1.0.0.pom
[JENKINS] Archiving <https://builds.apache.org/job/usergrid-stack/ws/stack/websocket/target/usergrid-websocket-1.0.0.jar>
to org.apache.usergrid/usergrid-websocket/1.0.0/usergrid-websocket-1.0.0.jar
[JENKINS] Archiving <https://builds.apache.org/job/usergrid-stack/ws/stack/websocket/target/usergrid-websocket-1.0.0-tests.jar>
to org.apache.usergrid/usergrid-websocket/1.0.0/usergrid-websocket-1.0.0-tests.jar
Sending artifact delta relative to usergrid-stack ? Usergrid Websocket #24
Archived 3 artifacts
Archive block size is 32768
Received 0 blocks and 51925 bytes
Compression is 0.0%
Took 0.15 sec
[JENKINS] Archiving <https://builds.apache.org/job/usergrid-stack/ws/stack/services/pom.xml>
to org.apache.usergrid/usergrid-services/1.0.0/usergrid-services-1.0.0.pom
[JENKINS] Archiving <https://builds.apache.org/job/usergrid-stack/ws/stack/services/target/usergrid-services-1.0.0.jar>
to org.apache.usergrid/usergrid-services/1.0.0/usergrid-services-1.0.0.jar
[JENKINS] Archiving <https://builds.apache.org/job/usergrid-stack/ws/stack/services/target/usergrid-services-1.0.0-tests.jar>
to org.apache.usergrid/usergrid-services/1.0.0/usergrid-services-1.0.0-tests.jar
Sending artifact delta relative to usergrid-stack ? Usergrid Services #24
Archived 3 artifacts
Archive block size is 32768
Received 0 blocks and 421922 bytes
Compression is 0.0%
Took 0.29 sec
[JENKINS] Archiving <https://builds.apache.org/job/usergrid-stack/ws/stack/pom.xml>
to org.apache.usergrid/usergrid/1.0.0/usergrid-1.0.0.pom
[JENKINS] Archiving <https://builds.apache.org/job/usergrid-stack/ws/stack/target/usergrid-1.0.0-tests.jar>
to org.apache.usergrid/usergrid/1.0.0/usergrid-1.0.0-tests.jar
Sending artifact delta relative to usergrid-stack ? Usergrid Parent #24
Archived 2 artifacts
Archive block size is 32768
Received 1 blocks and 34331 bytes
Compression is 48.8%
Took 1.5 sec
[JENKINS] Archiving <https://builds.apache.org/job/usergrid-stack/ws/stack/config/pom.xml>
to org.apache.usergrid/usergrid-config/1.0.0/usergrid-config-1.0.0.pom
[JENKINS] Archiving <https://builds.apache.org/job/usergrid-stack/ws/stack/config/target/usergrid-config-1.0.0.jar>
to org.apache.usergrid/usergrid-config/1.0.0/usergrid-config-1.0.0.jar
[JENKINS] Archiving <https://builds.apache.org/job/usergrid-stack/ws/stack/config/target/usergrid-config-1.0.0-tests.jar>
to org.apache.usergrid/usergrid-config/1.0.0/usergrid-config-1.0.0-tests.jar
Sending artifact delta relative to usergrid-stack ? Usergrid Config #24
Archived 3 artifacts
Archive block size is 32768
Received 0 blocks and 38861 bytes
Compression is 0.0%
Took 0.15 sec
[JENKINS] Archiving <https://builds.apache.org/job/usergrid-stack/ws/stack/launcher/pom.xml>
to org.apache.usergrid/usergrid-launcher/1.0.0/usergrid-launcher-1.0.0.pom
Sending artifact delta relative to usergrid-stack ? Usergrid Launcher #23
Archived 1 artifacts
Archive block size is 32768
Received 0 blocks and 7825 bytes
Compression is 0.0%
Took 0.69 sec
[JENKINS] Archiving <https://builds.apache.org/job/usergrid-stack/ws/stack/test-utils/pom.xml>
to org.apache.usergrid/usergrid-test-utils/1.0.0/usergrid-test-utils-1.0.0.pom
[JENKINS] Archiving <https://builds.apache.org/job/usergrid-stack/ws/stack/test-utils/target/usergrid-test-utils-1.0.0.jar>
to org.apache.usergrid/usergrid-test-utils/1.0.0/usergrid-test-utils-1.0.0.jar
[JENKINS] Archiving <https://builds.apache.org/job/usergrid-stack/ws/stack/test-utils/target/usergrid-test-utils-1.0.0-tests.jar>
to org.apache.usergrid/usergrid-test-utils/1.0.0/usergrid-test-utils-1.0.0-tests.jar
Sending artifact delta relative to usergrid-stack ? Usergrid Test Utils #24
Archived 3 artifacts
Archive block size is 32768
Received 0 blocks and 71686 bytes
Compression is 0.0%
Took 1.5 sec
[JENKINS] Archiving <https://builds.apache.org/job/usergrid-stack/ws/stack/core/pom.xml>
to org.apache.usergrid/usergrid-core/1.0.0/usergrid-core-1.0.0.pom
[JENKINS] Archiving <https://builds.apache.org/job/usergrid-stack/ws/stack/core/target/usergrid-core-1.0.0.jar>
to org.apache.usergrid/usergrid-core/1.0.0/usergrid-core-1.0.0.jar
[JENKINS] Archiving <https://builds.apache.org/job/usergrid-stack/ws/stack/core/target/usergrid-core-1.0.0-tests.jar>
to org.apache.usergrid/usergrid-core/1.0.0/usergrid-core-1.0.0-tests.jar
Sending artifact delta relative to usergrid-stack ? Usergrid Core #24
Archived 3 artifacts
Archive block size is 32768
Received 0 blocks and 1003815 bytes
Compression is 0.0%
Took 0.57 sec
[JENKINS] Archiving <https://builds.apache.org/job/usergrid-stack/ws/stack/rest/pom.xml>
to org.apache.usergrid/usergrid-rest/1.0.0/usergrid-rest-1.0.0.pom
[JENKINS] Archiving <https://builds.apache.org/job/usergrid-stack/ws/stack/rest/target/ROOT.war>
to org.apache.usergrid/usergrid-rest/1.0.0/usergrid-rest-1.0.0.war
[JENKINS] Archiving <https://builds.apache.org/job/usergrid-stack/ws/stack/rest/target/usergrid-rest-1.0.0-tests.jar>
to org.apache.usergrid/usergrid-rest/1.0.0/usergrid-rest-1.0.0-tests.jar
[JENKINS] Archiving <https://builds.apache.org/job/usergrid-stack/ws/stack/rest/target/usergrid-rest-1.0.0-classes.jar>
to org.apache.usergrid/usergrid-rest/1.0.0/usergrid-rest-1.0.0-classes.jar
[JENKINS] Archiving <https://builds.apache.org/job/usergrid-stack/ws/stack/rest/target/usergrid-rest-1.0.0-compiled-jsp.jar>
to org.apache.usergrid/usergrid-rest/1.0.0/usergrid-rest-1.0.0-compiled-jsp.jar
Sending artifact delta relative to usergrid-stack ? Usergrid REST #24
Archived 5 artifacts
Archive block size is 32768
Received 1225 blocks and 6143713 bytes
Compression is 86.7%
Took 5.4 sec
[JENKINS] Archiving <https://builds.apache.org/job/usergrid-stack/ws/stack/mongo-emulator/pom.xml>
to org.apache.usergrid/usergrid-mongo-emulator/1.0.0/usergrid-mongo-emulator-1.0.0.pom
[JENKINS] Archiving <https://builds.apache.org/job/usergrid-stack/ws/stack/mongo-emulator/target/usergrid-mongo-emulator-1.0.0.jar>
to org.apache.usergrid/usergrid-mongo-emulator/1.0.0/usergrid-mongo-emulator-1.0.0.jar
[JENKINS] Archiving <https://builds.apache.org/job/usergrid-stack/ws/stack/mongo-emulator/target/usergrid-mongo-emulator-1.0.0-tests.jar>
to org.apache.usergrid/usergrid-mongo-emulator/1.0.0/usergrid-mongo-emulator-1.0.0-tests.jar
Sending artifact delta relative to usergrid-stack ? Usergrid MongoDB Emulator #24
Archived 3 artifacts
Archive block size is 32768
Received 0 blocks and 106209 bytes
Compression is 0.0%
Took 0.12 sec
[JENKINS] Archiving <https://builds.apache.org/job/usergrid-stack/ws/stack/tools/pom.xml>
to org.apache.usergrid/usergrid-tools/1.0.0/usergrid-tools-1.0.0.pom
[JENKINS] Archiving <https://builds.apache.org/job/usergrid-stack/ws/stack/tools/target/usergrid-tools-1.0.0.jar>
to org.apache.usergrid/usergrid-tools/1.0.0/usergrid-tools-1.0.0.jar
[JENKINS] Archiving <https://builds.apache.org/job/usergrid-stack/ws/stack/tools/target/usergrid-tools-1.0.0-tests.jar>
to org.apache.usergrid/usergrid-tools/1.0.0/usergrid-tools-1.0.0-tests.jar
[JENKINS] Archiving <https://builds.apache.org/job/usergrid-stack/ws/stack/tools/target/usergrid-tools-1.0.0-release.tar.gz>
to org.apache.usergrid/usergrid-tools/1.0.0/usergrid-tools-1.0.0-release.tar.gz
Sending artifact delta relative to usergrid-stack ? Usergrid Tools #24
Archived 4 artifacts
Archive block size is 32768
Received 47 blocks and 84603515 bytes
Compression is 1.8%
Took 42 sec
[JENKINS] Archiving <https://builds.apache.org/job/usergrid-stack/ws/stack/java-sdk-old/pom.xml>
to org.usergrid/usergrid-java-client/0.0.3/usergrid-java-client-0.0.3.pom
[JENKINS] Archiving <https://builds.apache.org/job/usergrid-stack/ws/stack/java-sdk-old/target/usergrid-java-client-0.0.3.jar>
to org.usergrid/usergrid-java-client/0.0.3/usergrid-java-client-0.0.3.jar
[JENKINS] Archiving <https://builds.apache.org/job/usergrid-stack/ws/stack/java-sdk-old/target/usergrid-java-client-0.0.3-tests.jar>
to org.usergrid/usergrid-java-client/0.0.3/usergrid-java-client-0.0.3-tests.jar
Sending artifact delta relative to usergrid-stack ? Usergrid Java SDK 0.0.3 #24
Archived 3 artifacts
Archive block size is 32768
Received 0 blocks and 63275 bytes
Compression is 0.0%
Took 1.7 sec
Sending e-mails to: commits@usergrid.incubator.apache.org
Sending e-mails to: commits@usergrid.incubator.apache.org
channel stopped

Mime
View raw message