usergrid-commits mailing list archives

Site index · List index
Message view « Date » · « Thread »
Top « Date » · « Thread »
From Apache Jenkins Server <jenk...@builds.apache.org>
Subject Build failed in Jenkins: usergrid-stack #19
Date Wed, 20 Aug 2014 19:39:22 GMT
See <https://builds.apache.org/job/usergrid-stack/19/changes>

Changes:

[lewis.j.mcgibbney] USERGRID-208 License headers for all XML files

[rod] updated license headers, removed some unused libraries - angular, vessel

[lewis.j.mcgibbney] USERGRID-217 Add license headers for all x-sh scripts

[lewis.j.mcgibbney] USERGRID-218 Add license headers for all x-c scripts

[lewis.j.mcgibbney] USERGRID-219 dd license headers to all Java files

------------------------------------------
[...truncated 2060 lines...]
2014-08-20 19:38:15,336 WARN (pool-1-thread-1) [org.springframework.beans.GenericTypeAwarePropertyDescriptor]
- Invalid JavaBean property 'clockResolution' being accessed! Ambiguous write methods found
next to actually used [public static void me.prettyprint.cassandra.service.CassandraHostConfigurator.setClockResolution(me.prettyprint.hector.api.ClockResolution)]:
[public static void me.prettyprint.cassandra.service.CassandraHostConfigurator.setClockResolution(java.lang.String)]
2014-08-20 19:38:15,356 INFO (pool-1-thread-1) [me.prettyprint.cassandra.connection.CassandraHostRetryService]
- Downed Host Retry service started with queue size -1 and retry delay 10s
2014-08-20 19:38:15,359 INFO (pool-1-thread-1) [me.prettyprint.cassandra.service.JmxMonitor]
- Registering JMX me.prettyprint.cassandra.service_Test Cluster:ServiceType=hector,MonitorType=hector
2014-08-20 19:38:15,411 INFO (pool-1-thread-1) [me.prettyprint.cassandra.service.AbstractCluster]
- found knownPoolHosts: [localhost(127.0.0.1):9371]
Tests run: 1, Failures: 0, Errors: 0, Skipped: 0, Time elapsed: 16.121 sec - in org.apache.usergrid.batch.job.SchedulerRuntime1IT
Running org.apache.usergrid.batch.job.SchedulerRuntime6IT
2014-08-20 19:38:27,476 INFO (pool-1-thread-1) [org.springframework.context.support.ClassPathXmlApplicationContext]
- Refreshing org.springframework.context.support.ClassPathXmlApplicationContext@afd2ea: startup
date [Wed Aug 20 19:38:27 UTC 2014]; root of context hierarchy
2014-08-20 19:38:27,522 INFO (pool-1-thread-1) [org.springframework.beans.factory.xml.XmlBeanDefinitionReader]
- Loading XML bean definitions from class path resource [usergrid-test-context.xml]
2014-08-20 19:38:27,608 INFO (pool-1-thread-1) [org.springframework.beans.factory.xml.XmlBeanDefinitionReader]
- Loading XML bean definitions from class path resource [usergrid-core-context.xml]
2014-08-20 19:38:28,181 INFO (pool-1-thread-1) [org.springframework.beans.factory.config.PropertiesFactoryBean]
- Loading properties file from class path resource [usergrid-default.properties]
2014-08-20 19:38:28,182 INFO (pool-1-thread-1) [org.springframework.beans.factory.config.PropertiesFactoryBean]
- Loading properties file from class path resource [usergrid-test.properties]
2014-08-20 19:38:28,183 INFO (pool-1-thread-1) [org.springframework.beans.factory.config.PropertiesFactoryBean]
- Loading properties file from class path resource [usergrid-scheduler-test.properties]
2014-08-20 19:38:28,184 INFO (pool-1-thread-1) [org.springframework.beans.factory.config.PropertiesFactoryBean]
- Loading properties file from class path resource [usergrid-custom-test.properties]
2014-08-20 19:38:28,184 WARN (pool-1-thread-1) [org.springframework.beans.factory.config.PropertiesFactoryBean]
- Could not load properties from class path resource [usergrid-custom-test.properties]: class
path resource [usergrid-custom-test.properties] cannot be opened because it does not exist
2014-08-20 19:38:28,232 INFO (pool-1-thread-1) [org.springframework.beans.factory.support.DefaultListableBeanFactory]
- Pre-instantiating singletons in org.springframework.beans.factory.support.DefaultListableBeanFactory@155ba90:
defining beans [properties,org.springframework.context.annotation.internalConfigurationAnnotationProcessor,org.springframework.context.annotation.internalAutowiredAnnotationProcessor,org.springframework.context.annotation.internalRequiredAnnotationProcessor,org.springframework.context.annotation.internalCommonAnnotationProcessor,org.springframework.aop.config.internalAutoProxyCreator,propertyPlaceholderConfigurer,microsecondsTimeResolution,traceTagManager,traceTagReporter,taggedOpTimer,cassandraHostConfigurator,cassandraCluster,loadBalancingPolicy,lockManager,cassandraService,consistencyLevelPolicy,entityManagerFactory,queueManagerFactory,simpleBatcher,batchSubmitter,cassandraCounterStore,counterUtils,usergridSystemMonitor,indexBucketLocator,mailUtils,entityManager,relationManager,traceTagAspect,org.springframework.aop.aspectj.AspectJPointcutAdvisor#0,emTraceParticipant,jobSchedulerBackgroundService,schedulerService,jobFactory,metricsFactory,delayHeartbeat,failureJobExceuction,onlyOnceUnlockOnFailExceution,countdownLatch,onlyOnceExceution,delayExecution,setup,coreManager,org.springframework.context.annotation.ConfigurationClassPostProcessor$ImportAwareBeanPostProcessor#0];
root of factory hierarchy
2014-08-20 19:38:28,437 WARN (pool-1-thread-1) [org.springframework.beans.GenericTypeAwarePropertyDescriptor]
- Invalid JavaBean property 'clockResolution' being accessed! Ambiguous write methods found
next to actually used [public static void me.prettyprint.cassandra.service.CassandraHostConfigurator.setClockResolution(me.prettyprint.hector.api.ClockResolution)]:
[public static void me.prettyprint.cassandra.service.CassandraHostConfigurator.setClockResolution(java.lang.String)]
2014-08-20 19:38:28,452 INFO (pool-1-thread-1) [me.prettyprint.cassandra.connection.CassandraHostRetryService]
- Downed Host Retry service started with queue size -1 and retry delay 10s
2014-08-20 19:38:28,454 INFO (pool-1-thread-1) [me.prettyprint.cassandra.service.JmxMonitor]
- Registering JMX me.prettyprint.cassandra.service_Test Cluster:ServiceType=hector,MonitorType=hector
2014-08-20 19:38:28,487 INFO (pool-1-thread-1) [me.prettyprint.cassandra.service.AbstractCluster]
- found knownPoolHosts: [localhost(127.0.0.1):9903]
Tests run: 1, Failures: 0, Errors: 0, Skipped: 0, Time elapsed: 25.675 sec - in org.apache.usergrid.batch.job.SchedulerRuntime5IT
Running org.apache.usergrid.batch.AppArgsTest
Tests run: 3, Failures: 0, Errors: 0, Skipped: 0, Time elapsed: 0.088 sec - in org.apache.usergrid.batch.AppArgsTest
Running org.apache.usergrid.batch.UsergridJobFactoryTest
Tests run: 1, Failures: 0, Errors: 0, Skipped: 0, Time elapsed: 0.007 sec - in org.apache.usergrid.batch.UsergridJobFactoryTest
Running org.apache.usergrid.batch.BulkJobExecutionUnitTest
Tests run: 8, Failures: 0, Errors: 0, Skipped: 0, Time elapsed: 0.006 sec - in org.apache.usergrid.batch.BulkJobExecutionUnitTest
Running org.apache.usergrid.utils.IndexUtilsTest
Tests run: 2, Failures: 0, Errors: 0, Skipped: 0, Time elapsed: 0.628 sec - in org.apache.usergrid.utils.IndexUtilsTest
Running org.apache.usergrid.utils.ConversionUtilsTest
Tests run: 1, Failures: 0, Errors: 0, Skipped: 0, Time elapsed: 0.172 sec - in org.apache.usergrid.utils.ConversionUtilsTest
Running org.apache.usergrid.utils.ListUtilsTest
Tests run: 1, Failures: 0, Errors: 0, Skipped: 0, Time elapsed: 0.242 sec - in org.apache.usergrid.utils.ListUtilsTest
Running org.apache.usergrid.utils.TimeUtilsTest
Tests run: 4, Failures: 0, Errors: 0, Skipped: 0, Time elapsed: 0.024 sec - in org.apache.usergrid.utils.TimeUtilsTest
Running org.apache.usergrid.utils.JsonUtilsTest
{"name":"edanuff","cat":"fishbone","city":"San Francisco","car":"bmw","stuff":[1,2,3,4,5],"phones":[{"a":"b"},{"a":"c"},{"b":{"d":"f"}}]}
[{"a":"b"},{"a":"c"},{"b":{"d":"f"}}]
["b","c"]
Tests run: 2, Failures: 0, Errors: 0, Skipped: 0, Time elapsed: 0.262 sec - in org.apache.usergrid.utils.JsonUtilsTest
Running org.apache.usergrid.utils.MapUtilsTest
Tests run: 1, Failures: 0, Errors: 0, Skipped: 0, Time elapsed: 0.228 sec - in org.apache.usergrid.utils.MapUtilsTest
Running org.apache.usergrid.utils.MailUtilsTest
2014-08-20 19:38:45,711 ERROR (pool-1-thread-3) [org.apache.usergrid.utils.MailUtils] - MAIL-DELIVERY-FAILURE
- description: [could not send to bad address] recipient: [foo@bar.]
javax.mail.internet.AddressException: Domain ends with dot in string ``foo@bar.''
	at javax.mail.internet.InternetAddress.checkAddress(InternetAddress.java:1277)
	at javax.mail.internet.InternetAddress.parse(InternetAddress.java:1091)
	at javax.mail.internet.InternetAddress.parse(InternetAddress.java:633)
	at javax.mail.internet.InternetAddress.<init>(InternetAddress.java:111)
	at org.apache.usergrid.utils.MailUtils.sendMail(MailUtils.java:119)
	at org.apache.usergrid.utils.MailUtils.sendHtmlMail(MailUtils.java:147)
	at org.apache.usergrid.utils.MailUtilsTest.sendTestEmail(MailUtilsTest.java:83)
	at org.apache.usergrid.utils.MailUtilsTest.failedConstruction(MailUtilsTest.java:64)
	at sun.reflect.NativeMethodAccessorImpl.invoke0(Native Method)
	at sun.reflect.NativeMethodAccessorImpl.invoke(NativeMethodAccessorImpl.java:57)
	at sun.reflect.DelegatingMethodAccessorImpl.invoke(DelegatingMethodAccessorImpl.java:43)
	at java.lang.reflect.Method.invoke(Method.java:606)
	at org.junit.runners.model.FrameworkMethod$1.runReflectiveCall(FrameworkMethod.java:47)
	at org.junit.internal.runners.model.ReflectiveCallable.run(ReflectiveCallable.java:12)
	at org.junit.runners.model.FrameworkMethod.invokeExplosively(FrameworkMethod.java:44)
	at org.junit.internal.runners.statements.InvokeMethod.evaluate(InvokeMethod.java:17)
	at org.junit.internal.runners.statements.RunBefores.evaluate(RunBefores.java:26)
	at org.junit.runners.ParentRunner.runLeaf(ParentRunner.java:271)
	at org.junit.runners.BlockJUnit4ClassRunner.runChild(BlockJUnit4ClassRunner.java:70)
	at org.junit.runners.BlockJUnit4ClassRunner.runChild(BlockJUnit4ClassRunner.java:50)
	at org.junit.runners.ParentRunner$3.run(ParentRunner.java:238)
	at java.util.concurrent.Executors$RunnableAdapter.call(Executors.java:471)
	at java.util.concurrent.FutureTask$Sync.innerRun(FutureTask.java:334)
	at java.util.concurrent.FutureTask.run(FutureTask.java:166)
	at java.util.concurrent.ThreadPoolExecutor.runWorker(ThreadPoolExecutor.java:1145)
	at java.util.concurrent.ThreadPoolExecutor$Worker.run(ThreadPoolExecutor.java:615)
	at java.lang.Thread.run(Thread.java:724)
2014-08-20 19:38:45,711 ERROR (pool-1-thread-3) [org.apache.usergrid.utils.MailUtils] - MAIL-DELIVERY-FAILURE
- description: [could not send to bad address] recipient: [foo@bar.]
javax.mail.internet.AddressException: Domain ends with dot in string ``foo@bar.''
	at javax.mail.internet.InternetAddress.checkAddress(InternetAddress.java:1277)
	at javax.mail.internet.InternetAddress.parse(InternetAddress.java:1091)
	at javax.mail.internet.InternetAddress.parse(InternetAddress.java:633)
	at javax.mail.internet.InternetAddress.<init>(InternetAddress.java:111)
	at org.apache.usergrid.utils.MailUtils.sendMail(MailUtils.java:119)
	at org.apache.usergrid.utils.MailUtils.sendHtmlMail(MailUtils.java:147)
	at org.apache.usergrid.utils.MailUtilsTest.sendTestEmail(MailUtilsTest.java:83)
	at org.apache.usergrid.utils.MailUtilsTest.failedConstruction(MailUtilsTest.java:64)
	at sun.reflect.NativeMethodAccessorImpl.invoke0(Native Method)
	at sun.reflect.NativeMethodAccessorImpl.invoke(NativeMethodAccessorImpl.java:57)
	at sun.reflect.DelegatingMethodAccessorImpl.invoke(DelegatingMethodAccessorImpl.java:43)
	at java.lang.reflect.Method.invoke(Method.java:606)
	at org.junit.runners.model.FrameworkMethod$1.runReflectiveCall(FrameworkMethod.java:47)
	at org.junit.internal.runners.model.ReflectiveCallable.run(ReflectiveCallable.java:12)
	at org.junit.runners.model.FrameworkMethod.invokeExplosively(FrameworkMethod.java:44)
	at org.junit.internal.runners.statements.InvokeMethod.evaluate(InvokeMethod.java:17)
	at org.junit.internal.runners.statements.RunBefores.evaluate(RunBefores.java:26)
	at org.junit.runners.ParentRunner.runLeaf(ParentRunner.java:271)
	at org.junit.runners.BlockJUnit4ClassRunner.runChild(BlockJUnit4ClassRunner.java:70)
	at org.junit.runners.BlockJUnit4ClassRunner.runChild(BlockJUnit4ClassRunner.java:50)
	at org.junit.runners.ParentRunner$3.run(ParentRunner.java:238)
	at java.util.concurrent.Executors$RunnableAdapter.call(Executors.java:471)
	at java.util.concurrent.FutureTask$Sync.innerRun(FutureTask.java:334)
	at java.util.concurrent.FutureTask.run(FutureTask.java:166)
	at java.util.concurrent.ThreadPoolExecutor.runWorker(ThreadPoolExecutor.java:1145)
	at java.util.concurrent.ThreadPoolExecutor$Worker.run(ThreadPoolExecutor.java:615)
	at java.lang.Thread.run(Thread.java:724)
Tests run: 4, Failures: 0, Errors: 0, Skipped: 0, Time elapsed: 0.406 sec - in org.apache.usergrid.utils.MailUtilsTest
Running org.apache.usergrid.utils.UUIDUtilsTest
1408563526284
1408563526284
Tests run: 1, Failures: 0, Errors: 0, Skipped: 0, Time elapsed: 24.863 sec - in org.apache.usergrid.batch.job.SchedulerRuntime6IT
Tests run: 20, Failures: 0, Errors: 0, Skipped: 1, Time elapsed: 7.665 sec - in org.apache.usergrid.utils.UUIDUtilsTest
2014-08-20 19:38:55,644 INFO (main) [org.springframework.context.support.ClassPathXmlApplicationContext]
- Refreshing org.springframework.context.support.ClassPathXmlApplicationContext@84c504: startup
date [Wed Aug 20 19:38:55 UTC 2014]; root of context hierarchy
2014-08-20 19:38:55,694 INFO (main) [org.springframework.beans.factory.xml.XmlBeanDefinitionReader]
- Loading XML bean definitions from class path resource [usergrid-test-context.xml]
2014-08-20 19:38:55,785 INFO (main) [org.springframework.beans.factory.xml.XmlBeanDefinitionReader]
- Loading XML bean definitions from class path resource [usergrid-core-context.xml]
2014-08-20 19:38:56,305 INFO (main) [org.springframework.beans.factory.config.PropertiesFactoryBean]
- Loading properties file from class path resource [usergrid-default.properties]
2014-08-20 19:38:56,306 INFO (main) [org.springframework.beans.factory.config.PropertiesFactoryBean]
- Loading properties file from class path resource [usergrid-test.properties]
2014-08-20 19:38:56,307 INFO (main) [org.springframework.beans.factory.config.PropertiesFactoryBean]
- Loading properties file from class path resource [usergrid-scheduler-test.properties]
2014-08-20 19:38:56,307 INFO (main) [org.springframework.beans.factory.config.PropertiesFactoryBean]
- Loading properties file from class path resource [usergrid-custom-test.properties]
2014-08-20 19:38:56,307 WARN (main) [org.springframework.beans.factory.config.PropertiesFactoryBean]
- Could not load properties from class path resource [usergrid-custom-test.properties]: class
path resource [usergrid-custom-test.properties] cannot be opened because it does not exist
2014-08-20 19:38:56,355 INFO (main) [org.springframework.beans.factory.support.DefaultListableBeanFactory]
- Pre-instantiating singletons in org.springframework.beans.factory.support.DefaultListableBeanFactory@1e43069:
defining beans [properties,org.springframework.context.annotation.internalConfigurationAnnotationProcessor,org.springframework.context.annotation.internalAutowiredAnnotationProcessor,org.springframework.context.annotation.internalRequiredAnnotationProcessor,org.springframework.context.annotation.internalCommonAnnotationProcessor,org.springframework.aop.config.internalAutoProxyCreator,propertyPlaceholderConfigurer,microsecondsTimeResolution,traceTagManager,traceTagReporter,taggedOpTimer,cassandraHostConfigurator,cassandraCluster,loadBalancingPolicy,lockManager,cassandraService,consistencyLevelPolicy,entityManagerFactory,queueManagerFactory,simpleBatcher,batchSubmitter,cassandraCounterStore,counterUtils,usergridSystemMonitor,indexBucketLocator,mailUtils,entityManager,relationManager,traceTagAspect,org.springframework.aop.aspectj.AspectJPointcutAdvisor#0,emTraceParticipant,jobSchedulerBackgroundService,schedulerService,jobFactory,metricsFactory,delayHeartbeat,failureJobExceuction,onlyOnceUnlockOnFailExceution,countdownLatch,onlyOnceExceution,delayExecution,setup,coreManager,org.springframework.context.annotation.ConfigurationClassPostProcessor$ImportAwareBeanPostProcessor#0];
root of factory hierarchy
2014-08-20 19:38:56,566 WARN (main) [org.springframework.beans.GenericTypeAwarePropertyDescriptor]
- Invalid JavaBean property 'clockResolution' being accessed! Ambiguous write methods found
next to actually used [public static void me.prettyprint.cassandra.service.CassandraHostConfigurator.setClockResolution(me.prettyprint.hector.api.ClockResolution)]:
[public static void me.prettyprint.cassandra.service.CassandraHostConfigurator.setClockResolution(java.lang.String)]
2014-08-20 19:38:56,581 INFO (main) [me.prettyprint.cassandra.connection.CassandraHostRetryService]
- Downed Host Retry service started with queue size -1 and retry delay 10s
2014-08-20 19:38:56,583 INFO (main) [me.prettyprint.cassandra.service.JmxMonitor] - Registering
JMX me.prettyprint.cassandra.service_Test Cluster:ServiceType=hector,MonitorType=hector
2014-08-20 19:38:56,618 INFO (main) [me.prettyprint.cassandra.service.AbstractCluster] - found
knownPoolHosts: [localhost(127.0.0.1):9971]
2014-08-20 19:39:03,686 INFO (main) [me.prettyprint.cassandra.locking.AbstractLockManager]
- HLockManagerConfigurator [keyspaceName=Locks_Test, lockManagerCF=HLocks, rowsCacheEnabled=true,
locksTTLInMillis=2000, backOffRetryDelayInMillis=100, replicationFactor=1, numberOfLockObserverThreads=1,
maxSelectSize=10]
2014-08-20 19:39:03,687 INFO (main) [me.prettyprint.cassandra.locking.AbstractLockManager]
- Creating Keyspace and Column Family for LockManager with name (KSPS/CF): (Locks_Test / HLocks
Running org.apache.usergrid.locking.cassandra.HectorLockManagerIT
Tests run: 2, Failures: 0, Errors: 0, Skipped: 0, Time elapsed: 0.399 sec - in org.apache.usergrid.locking.cassandra.HectorLockManagerIT

Results :

Tests run: 294, Failures: 0, Errors: 0, Skipped: 4

[JENKINS] Recording test results
[INFO] ------------------------------------------------------------------------
[INFO] Reactor Summary:
[INFO] 
[INFO] Usergrid Parent ................................... SUCCESS [15.616s]
[INFO] Usergrid Build Tools .............................. SUCCESS [2.778s]
[INFO] Usergrid Config ................................... SUCCESS [0.618s]
[INFO] Usergrid Test Utils ............................... SUCCESS [14.320s]
[INFO] Usergrid Core ..................................... FAILURE [4:41.363s]
[INFO] Usergrid Services ................................. SKIPPED
[INFO] Usergrid MongoDB Emulator ......................... SKIPPED
[INFO] Usergrid REST ..................................... SKIPPED
[INFO] Usergrid Tools .................................... SKIPPED
[INFO] Usergrid Websocket ................................ SKIPPED
[INFO] Usergrid Launcher ................................. SKIPPED
[INFO] ------------------------------------------------------------------------
[INFO] BUILD FAILURE
[INFO] ------------------------------------------------------------------------
[INFO] Total time: 5:20.265s
[INFO] Finished at: Wed Aug 20 19:39:09 UTC 2014
[INFO] Final Memory: 29M/178M
[INFO] ------------------------------------------------------------------------
Waiting for Jenkins to finish collecting data
[ERROR] Failed to execute goal org.apache.maven.plugins:maven-surefire-plugin:2.15:test (default-test)
on project usergrid-core: ExecutionException; nested exception is java.util.concurrent.ExecutionException:
java.lang.RuntimeException: The forked VM terminated without saying properly goodbye. VM crash
or System.exit called ?
[ERROR] Command was/bin/sh -c cd <https://builds.apache.org/job/usergrid-stack/ws/stack/core>
&& /x1/jenkins/tools/java/jdk1.7.0_25-32/jre/bin/java -Xmx1024m -Xms1024m -Dfile.encoding=UTF-8
-Dsun.jnu.encoding=UTF-8 -javaagent:/home/jenkins/jenkins-slave/maven-repositories/1/com/github/stephenc/jamm/0.2.5/jamm-0.2.5.jar
-jar <https://builds.apache.org/job/usergrid-stack/ws/stack/core/target/surefire/surefirebooter120616976764856212.jar>
<https://builds.apache.org/job/usergrid-stack/ws/stack/core/target/surefire/surefire9217568609767307304tmp>
<https://builds.apache.org/job/usergrid-stack/ws/stack/core/target/surefire/surefire_171298579382164798123tmp>
[ERROR] -> [Help 1]
[ERROR] 
[ERROR] To see the full stack trace of the errors, re-run Maven with the -e switch.
[ERROR] Re-run Maven using the -X switch to enable full debug logging.
[ERROR] 
[ERROR] For more information about the errors and possible solutions, please read the following
articles:
[ERROR] [Help 1] http://cwiki.apache.org/confluence/display/MAVEN/MojoFailureException
[ERROR] 
[ERROR] After correcting the problems, you can resume the build with the command
[ERROR]   mvn <goals> -rf :usergrid-core
[JENKINS] Archiving <https://builds.apache.org/job/usergrid-stack/ws/stack/build-tools/pom.xml>
to org.apache.usergrid/build-tools/0.0.29-SNAPSHOT/build-tools-0.0.29-SNAPSHOT.pom
[JENKINS] Archiving <https://builds.apache.org/job/usergrid-stack/ws/stack/build-tools/target/build-tools-0.0.29-SNAPSHOT.jar>
to org.apache.usergrid/build-tools/0.0.29-SNAPSHOT/build-tools-0.0.29-SNAPSHOT.jar
[JENKINS] Archiving <https://builds.apache.org/job/usergrid-stack/ws/stack/build-tools/target/build-tools-0.0.29-SNAPSHOT-tests.jar>
to org.apache.usergrid/build-tools/0.0.29-SNAPSHOT/build-tools-0.0.29-SNAPSHOT-tests.jar
Sending artifact delta relative to usergrid-stack ? Usergrid Build Tools #18
Archived 3 artifacts
Archive block size is 32768
Received 0 blocks and 9472 bytes
Compression is 0.0%
Took 46 ms
[JENKINS] Archiving <https://builds.apache.org/job/usergrid-stack/ws/stack/websocket/pom.xml>
to org.apache.usergrid/usergrid-websocket/0.0.29-SNAPSHOT/usergrid-websocket-0.0.29-SNAPSHOT.pom
Sending artifact delta relative to usergrid-stack ? Usergrid Websocket #18
Archived 1 artifacts
Archive block size is 32768
Received 0 blocks and 6093 bytes
Compression is 0.0%
Took 46 ms
[JENKINS] Archiving <https://builds.apache.org/job/usergrid-stack/ws/stack/services/pom.xml>
to org.apache.usergrid/usergrid-services/0.0.29-SNAPSHOT/usergrid-services-0.0.29-SNAPSHOT.pom
Sending artifact delta relative to usergrid-stack ? Usergrid Services #18
Archived 1 artifacts
Archive block size is 32768
Received 0 blocks and 18187 bytes
Compression is 0.0%
Took 63 ms
[JENKINS] Archiving <https://builds.apache.org/job/usergrid-stack/ws/stack/pom.xml>
to org.apache.usergrid/usergrid/0.0.29-SNAPSHOT/usergrid-0.0.29-SNAPSHOT.pom
[JENKINS] Archiving <https://builds.apache.org/job/usergrid-stack/ws/stack/target/usergrid-0.0.29-SNAPSHOT-tests.jar>
to org.apache.usergrid/usergrid/0.0.29-SNAPSHOT/usergrid-0.0.29-SNAPSHOT-tests.jar
Sending artifact delta relative to usergrid-stack ? Usergrid Parent #18
Archived 2 artifacts
Archive block size is 32768
Received 1 blocks and 34060 bytes
Compression is 49.0%
Took 36 ms
[JENKINS] Archiving <https://builds.apache.org/job/usergrid-stack/ws/stack/config/pom.xml>
to org.apache.usergrid/usergrid-config/0.0.29-SNAPSHOT/usergrid-config-0.0.29-SNAPSHOT.pom
[JENKINS] Archiving <https://builds.apache.org/job/usergrid-stack/ws/stack/config/target/usergrid-config-0.0.29-SNAPSHOT.jar>
to org.apache.usergrid/usergrid-config/0.0.29-SNAPSHOT/usergrid-config-0.0.29-SNAPSHOT.jar
[JENKINS] Archiving <https://builds.apache.org/job/usergrid-stack/ws/stack/config/target/usergrid-config-0.0.29-SNAPSHOT-tests.jar>
to org.apache.usergrid/usergrid-config/0.0.29-SNAPSHOT/usergrid-config-0.0.29-SNAPSHOT-tests.jar
Sending artifact delta relative to usergrid-stack ? Usergrid Config #18
Archived 3 artifacts
Archive block size is 32768
Received 0 blocks and 29462 bytes
Compression is 0.0%
Took 21 ms
[JENKINS] Archiving <https://builds.apache.org/job/usergrid-stack/ws/stack/launcher/pom.xml>
to org.apache.usergrid/usergrid-launcher/0.0.29-SNAPSHOT/usergrid-launcher-0.0.29-SNAPSHOT.pom
Sending artifact delta relative to usergrid-stack ? Usergrid Launcher #18
Archived 1 artifacts
Archive block size is 32768
Received 0 blocks and 7818 bytes
Compression is 0.0%
Took 2.4 sec
[JENKINS] Archiving <https://builds.apache.org/job/usergrid-stack/ws/stack/test-utils/pom.xml>
to org.apache.usergrid/usergrid-test-utils/0.0.29-SNAPSHOT/usergrid-test-utils-0.0.29-SNAPSHOT.pom
[JENKINS] Archiving <https://builds.apache.org/job/usergrid-stack/ws/stack/test-utils/target/usergrid-test-utils-0.0.29-SNAPSHOT.jar>
to org.apache.usergrid/usergrid-test-utils/0.0.29-SNAPSHOT/usergrid-test-utils-0.0.29-SNAPSHOT.jar
[JENKINS] Archiving <https://builds.apache.org/job/usergrid-stack/ws/stack/test-utils/target/usergrid-test-utils-0.0.29-SNAPSHOT-tests.jar>
to org.apache.usergrid/usergrid-test-utils/0.0.29-SNAPSHOT/usergrid-test-utils-0.0.29-SNAPSHOT-tests.jar
Sending artifact delta relative to usergrid-stack ? Usergrid Test Utils #18
Archived 3 artifacts
Archive block size is 32768
Received 0 blocks and 58650 bytes
Compression is 0.0%
Took 41 ms
[JENKINS] Archiving <https://builds.apache.org/job/usergrid-stack/ws/stack/core/pom.xml>
to org.apache.usergrid/usergrid-core/0.0.29-SNAPSHOT/usergrid-core-0.0.29-SNAPSHOT.pom
Sending artifact delta relative to usergrid-stack ? Usergrid Core #18
Archived 1 artifacts
Archive block size is 32768
Received 0 blocks and 19339 bytes
Compression is 0.0%
Took 67 ms
[JENKINS] Archiving <https://builds.apache.org/job/usergrid-stack/ws/stack/rest/pom.xml>
to org.apache.usergrid/usergrid-rest/0.0.29-SNAPSHOT/usergrid-rest-0.0.29-SNAPSHOT.pom
Sending artifact delta relative to usergrid-stack ? Usergrid REST #18
Archived 1 artifacts
Archive block size is 32768
Received 0 blocks and 19862 bytes
Compression is 0.0%
Took 2.6 sec
[JENKINS] Archiving <https://builds.apache.org/job/usergrid-stack/ws/stack/mongo-emulator/pom.xml>
to org.apache.usergrid/usergrid-mongo-emulator/0.0.29-SNAPSHOT/usergrid-mongo-emulator-0.0.29-SNAPSHOT.pom
Sending artifact delta relative to usergrid-stack ? Usergrid MongoDB Emulator #18
Archived 1 artifacts
Archive block size is 32768
Received 0 blocks and 5518 bytes
Compression is 0.0%
Took 41 ms
[JENKINS] Archiving <https://builds.apache.org/job/usergrid-stack/ws/stack/tools/pom.xml>
to org.apache.usergrid/usergrid-tools/0.0.29-SNAPSHOT/usergrid-tools-0.0.29-SNAPSHOT.pom
Sending artifact delta relative to usergrid-stack ? Usergrid Tools #18
Archived 1 artifacts
Archive block size is 32768
Received 0 blocks and 7431 bytes
Compression is 0.0%
Took 3 sec
Sending e-mails to: commits@usergrid.incubator.apache.org
channel stopped

Mime
View raw message