usergrid-commits mailing list archives

Site index · List index
Message view « Date » · « Thread »
Top « Date » · « Thread »
From Apache Jenkins Server <jenk...@builds.apache.org>
Subject Build failed in Jenkins: usergrid-stack #112
Date Sun, 07 Apr 2019 07:53:23 GMT
See <https://builds.apache.org/job/usergrid-stack/112/display/redirect>

------------------------------------------
[...truncated 55.16 KB...]
[INFO] Exclude: **/dummy.txt
[INFO] Exclude: **/cloudbees.xml
[INFO] Exclude: **/catalina_base/**
[INFO] 7 resources included (use -debug for more details)
[INFO] Rat check: Summary of files. Unapproved: 0 unknown: 0 generated: 0 approved: 6 licence.
[INFO] 
[INFO] --- maven-install-plugin:2.5.2:install (default-install) @ usergrid-config ---
[INFO] Installing <https://builds.apache.org/job/usergrid-stack/ws/stack/config/target/usergrid-config-2.2.0-SNAPSHOT.jar>
to /home/jenkins/jenkins-slave/maven-repositories/1/org/apache/usergrid/usergrid-config/2.2.0-SNAPSHOT/usergrid-config-2.2.0-SNAPSHOT.jar
[INFO] Installing <https://builds.apache.org/job/usergrid-stack/ws/stack/config/pom.xml>
to /home/jenkins/jenkins-slave/maven-repositories/1/org/apache/usergrid/usergrid-config/2.2.0-SNAPSHOT/usergrid-config-2.2.0-SNAPSHOT.pom
[INFO] Installing <https://builds.apache.org/job/usergrid-stack/ws/stack/config/target/usergrid-config-2.2.0-SNAPSHOT-tests.jar>
to /home/jenkins/jenkins-slave/maven-repositories/1/org/apache/usergrid/usergrid-config/2.2.0-SNAPSHOT/usergrid-config-2.2.0-SNAPSHOT-tests.jar
[INFO] 
[INFO] --- maven-enforcer-plugin:1.3.1:enforce (enforce-java) @ usergrid-config ---
[INFO] 
[INFO] --- jacoco-maven-plugin:0.7.5.201505241946:prepare-agent (default-prepare-agent) @
usergrid-config ---
[INFO] argLine set to -javaagent:/home/jenkins/jenkins-slave/maven-repositories/1/org/jacoco/org.jacoco.agent/0.7.5.201505241946/org.jacoco.agent-0.7.5.201505241946-runtime.jar=destfile=<https://builds.apache.org/job/usergrid-stack/ws/stack/config/target/jacoco.exec>
[INFO] 
[INFO] --- maven-remote-resources-plugin:1.5:process (default) @ usergrid-config ---
[INFO] 
[INFO] --- maven-resources-plugin:2.6:resources (default-resources) @ usergrid-config ---
[INFO] Using 'UTF-8' encoding to copy filtered resources.
[INFO] Copying 1 resource
[INFO] Copying 3 resources
[INFO] Copying 3 resources
[INFO] 
[INFO] --- maven-compiler-plugin:3.1:compile (default-compile) @ usergrid-config ---
[INFO] No sources to compile
[INFO] 
[INFO] --- maven-resources-plugin:2.6:testResources (default-testResources) @ usergrid-config
---
[INFO] Using 'UTF-8' encoding to copy filtered resources.
[INFO] Copying 4 resources
[INFO] Copying 3 resources
[INFO] Copying 3 resources
[INFO] 
[INFO] --- maven-compiler-plugin:3.1:testCompile (default-testCompile) @ usergrid-config ---
[INFO] No sources to compile
[INFO] 
[INFO] --- maven-surefire-plugin:2.18.1:test (default-test) @ usergrid-config ---
[INFO] Skipping execution of surefire because it has already been run for this configuration
[JENKINS] Recording test results
[INFO] 
[INFO] --- jacoco-maven-plugin:0.7.5.201505241946:report (default-report) @ usergrid-config
---
[INFO] Skipping JaCoCo execution due to missing execution data <https://builds.apache.org/job/usergrid-stack/ws/stack/config/target/jacoco.exec>
[INFO] 
[INFO] --- maven-jar-plugin:2.5:jar (default-jar) @ usergrid-config ---
[INFO] Building jar: <https://builds.apache.org/job/usergrid-stack/ws/stack/config/target/usergrid-config-2.2.0-SNAPSHOT.jar>
[INFO] 
[INFO] --- maven-site-plugin:3.4:attach-descriptor (attach-descriptor) @ usergrid-config ---
[INFO] 
[INFO] --- maven-jar-plugin:2.5:test-jar (test-jar-execution) @ usergrid-config ---
[INFO] Building jar: <https://builds.apache.org/job/usergrid-stack/ws/stack/config/target/usergrid-config-2.2.0-SNAPSHOT-tests.jar>
[INFO] 
[INFO] --- jacoco-maven-plugin:0.7.5.201505241946:check (default-check) @ usergrid-config
---
[INFO] Skipping JaCoCo execution due to missing execution data <https://builds.apache.org/job/usergrid-stack/ws/stack/config/target/jacoco.exec>
[INFO] 
[INFO] --- apache-rat-plugin:0.11:check (default) @ usergrid-config ---
[INFO] 51 implicit excludes (use -debug for more details).
[INFO] Exclude: **/Coverage.md
[INFO] Exclude: **/jacoco/**
[INFO] Exclude: **/README.md
[INFO] Exclude: **/CHANGES.txt
[INFO] Exclude: **/*.json
[INFO] Exclude: **/*.log
[INFO] Exclude: **/*.md5
[INFO] Exclude: **/*.opts
[INFO] Exclude: **/.git/**
[INFO] Exclude: **/.gitignore
[INFO] Exclude: **/.idea/**
[INFO] Exclude: **/*.iml
[INFO] Exclude: **/*.log
[INFO] Exclude: **/nbactions.xml
[INFO] Exclude: **/nb-configuration.xml
[INFO] Exclude: **/.classpath/**
[INFO] Exclude: **/.project
[INFO] Exclude: **/.settings/**
[INFO] Exclude: **/logs/**
[INFO] Exclude: **/docs/**
[INFO] Exclude: **/tmp/**
[INFO] Exclude: **/target/**
[INFO] Exclude: **/antlr3/**
[INFO] Exclude: **/META-INF/**
[INFO] Exclude: **/dependency-reduced-pom.xml
[INFO] Exclude: **/**QueryFilter.tokens
[INFO] Exclude: **/**QueryFilterLexer.java
[INFO] Exclude: **/**QueryFilterParser.java
[INFO] Exclude: **/**.conf
[INFO] Exclude: **/**.csv
[INFO] Exclude: **/aws.properties
[INFO] Exclude: **/tempExport*
[INFO] Exclude: loadtests/loadtest_setup.sh
[INFO] Exclude: loadtests/gatling/user-files/request-bodies/**
[INFO] Exclude: loadtests/.java-version
[INFO] Exclude: loadtests/src/main/scala/org/apache/usergrid/datagenerators/datafiles/**.txt
[INFO] Exclude: loadtests/src/main/scala/org/apache/usergrid/datagenerators/**.txt
[INFO] Exclude: loadtests/src/test/resources/**.csv
[INFO] Exclude: **/catalina_base/**
[INFO] Exclude: **/m2/**
[INFO] Exclude: **/*.asc
[INFO] Exclude: **/dummy.txt
[INFO] Exclude: **/cloudbees.xml
[INFO] Exclude: **/catalina_base/**
[INFO] 7 resources included (use -debug for more details)
[INFO] Rat check: Summary of files. Unapproved: 0 unknown: 0 generated: 0 approved: 6 licence.
[INFO] 
[INFO] --- maven-install-plugin:2.5.2:install (default-install) @ usergrid-config ---
[INFO] Installing <https://builds.apache.org/job/usergrid-stack/ws/stack/config/target/usergrid-config-2.2.0-SNAPSHOT.jar>
to /home/jenkins/jenkins-slave/maven-repositories/1/org/apache/usergrid/usergrid-config/2.2.0-SNAPSHOT/usergrid-config-2.2.0-SNAPSHOT.jar
[INFO] Installing <https://builds.apache.org/job/usergrid-stack/ws/stack/config/pom.xml>
to /home/jenkins/jenkins-slave/maven-repositories/1/org/apache/usergrid/usergrid-config/2.2.0-SNAPSHOT/usergrid-config-2.2.0-SNAPSHOT.pom
[INFO] Installing <https://builds.apache.org/job/usergrid-stack/ws/stack/config/target/usergrid-config-2.2.0-SNAPSHOT-tests.jar>
to /home/jenkins/jenkins-slave/maven-repositories/1/org/apache/usergrid/usergrid-config/2.2.0-SNAPSHOT/usergrid-config-2.2.0-SNAPSHOT-tests.jar
[INFO] Installing <https://builds.apache.org/job/usergrid-stack/ws/stack/config/target/usergrid-config-2.2.0-SNAPSHOT-tests.jar>
to /home/jenkins/jenkins-slave/maven-repositories/1/org/apache/usergrid/usergrid-config/2.2.0-SNAPSHOT/usergrid-config-2.2.0-SNAPSHOT-tests.jar
[INFO] 
[INFO] --- maven-deploy-plugin:2.8.2:deploy (default-deploy) @ usergrid-config ---
[INFO] Downloading from apache.snapshots.https: https://repository.apache.org/content/repositories/snapshots/org/apache/usergrid/usergrid-config/2.2.0-SNAPSHOT/maven-metadata.xml
[INFO] Uploading to apache.snapshots.https: https://repository.apache.org/content/repositories/snapshots/org/apache/usergrid/usergrid-config/2.2.0-SNAPSHOT/usergrid-config-2.2.0-20190407.075150-1.jar
[INFO] Uploaded to apache.snapshots.https: https://repository.apache.org/content/repositories/snapshots/org/apache/usergrid/usergrid-config/2.2.0-SNAPSHOT/usergrid-config-2.2.0-20190407.075150-1.jar
(16 kB at 14 kB/s)
[INFO] Uploading to apache.snapshots.https: https://repository.apache.org/content/repositories/snapshots/org/apache/usergrid/usergrid-config/2.2.0-SNAPSHOT/usergrid-config-2.2.0-20190407.075150-1.pom
[INFO] Uploaded to apache.snapshots.https: https://repository.apache.org/content/repositories/snapshots/org/apache/usergrid/usergrid-config/2.2.0-SNAPSHOT/usergrid-config-2.2.0-20190407.075150-1.pom
(2.0 kB at 1.8 kB/s)
[INFO] Downloading from apache.snapshots.https: https://repository.apache.org/content/repositories/snapshots/org/apache/usergrid/usergrid-config/maven-metadata.xml
[INFO] Uploading to apache.snapshots.https: https://repository.apache.org/content/repositories/snapshots/org/apache/usergrid/usergrid-config/2.2.0-SNAPSHOT/maven-metadata.xml
[INFO] Uploaded to apache.snapshots.https: https://repository.apache.org/content/repositories/snapshots/org/apache/usergrid/usergrid-config/2.2.0-SNAPSHOT/maven-metadata.xml
(784 B at 686 B/s)
[INFO] Uploading to apache.snapshots.https: https://repository.apache.org/content/repositories/snapshots/org/apache/usergrid/usergrid-config/maven-metadata.xml
[INFO] Uploaded to apache.snapshots.https: https://repository.apache.org/content/repositories/snapshots/org/apache/usergrid/usergrid-config/maven-metadata.xml
(294 B at 258 B/s)
[INFO] Uploading to apache.snapshots.https: https://repository.apache.org/content/repositories/snapshots/org/apache/usergrid/usergrid-config/2.2.0-SNAPSHOT/usergrid-config-2.2.0-20190407.075150-1-tests.jar
[INFO] Uploaded to apache.snapshots.https: https://repository.apache.org/content/repositories/snapshots/org/apache/usergrid/usergrid-config/2.2.0-SNAPSHOT/usergrid-config-2.2.0-20190407.075150-1-tests.jar
(26 kB at 22 kB/s)
[INFO] Uploading to apache.snapshots.https: https://repository.apache.org/content/repositories/snapshots/org/apache/usergrid/usergrid-config/2.2.0-SNAPSHOT/maven-metadata.xml
[INFO] Uploaded to apache.snapshots.https: https://repository.apache.org/content/repositories/snapshots/org/apache/usergrid/usergrid-config/2.2.0-SNAPSHOT/maven-metadata.xml
(996 B at 898 B/s)
[INFO] Uploading to apache.snapshots.https: https://repository.apache.org/content/repositories/snapshots/org/apache/usergrid/usergrid-config/2.2.0-SNAPSHOT/usergrid-config-2.2.0-20190407.075150-1-tests.jar
[INFO] Uploaded to apache.snapshots.https: https://repository.apache.org/content/repositories/snapshots/org/apache/usergrid/usergrid-config/2.2.0-SNAPSHOT/usergrid-config-2.2.0-20190407.075150-1-tests.jar
(26 kB at 21 kB/s)
[INFO] Uploading to apache.snapshots.https: https://repository.apache.org/content/repositories/snapshots/org/apache/usergrid/usergrid-config/2.2.0-SNAPSHOT/maven-metadata.xml
[INFO] Uploaded to apache.snapshots.https: https://repository.apache.org/content/repositories/snapshots/org/apache/usergrid/usergrid-config/2.2.0-SNAPSHOT/maven-metadata.xml
(996 B at 875 B/s)
[INFO] 
[INFO] ------------------< org.apache.usergrid:persistence >-------------------
[INFO] Building Usergrid Persistence 2.2.0-SNAPSHOT                      [4/20]
[INFO] --------------------------------[ pom ]---------------------------------
[INFO] 
[INFO] --- maven-clean-plugin:2.5:clean (default-clean) @ persistence ---
[INFO] 
[INFO] --- jacoco-maven-plugin:0.7.5.201505241946:prepare-agent (default-prepare-agent) @
persistence ---
[INFO] argLine set to -javaagent:/home/jenkins/jenkins-slave/maven-repositories/1/org/jacoco/org.jacoco.agent/0.7.5.201505241946/org.jacoco.agent-0.7.5.201505241946-runtime.jar=destfile=<https://builds.apache.org/job/usergrid-stack/ws/stack/corepersistence/target/jacoco.exec>
[INFO] 
[INFO] --- jacoco-maven-plugin:0.7.5.201505241946:report (default-report) @ persistence ---
[INFO] Skipping JaCoCo execution due to missing execution data <https://builds.apache.org/job/usergrid-stack/ws/stack/corepersistence/target/jacoco.exec>
[INFO] 
[INFO] --- maven-jar-plugin:2.4:test-jar (default) @ persistence ---
[WARNING] JAR will be empty - no content was marked for inclusion!
[INFO] Building jar: <https://builds.apache.org/job/usergrid-stack/ws/stack/corepersistence/target/persistence-2.2.0-SNAPSHOT-tests.jar>
[INFO] 
[INFO] --- jacoco-maven-plugin:0.7.5.201505241946:check (default-check) @ persistence ---
[INFO] Skipping JaCoCo execution due to missing execution data <https://builds.apache.org/job/usergrid-stack/ws/stack/corepersistence/target/jacoco.exec>
[INFO] 
[INFO] --- maven-install-plugin:2.4:install (default-install) @ persistence ---
[INFO] Installing <https://builds.apache.org/job/usergrid-stack/ws/stack/corepersistence/pom.xml>
to /home/jenkins/jenkins-slave/maven-repositories/1/org/apache/usergrid/persistence/2.2.0-SNAPSHOT/persistence-2.2.0-SNAPSHOT.pom
[INFO] Installing <https://builds.apache.org/job/usergrid-stack/ws/stack/corepersistence/target/persistence-2.2.0-SNAPSHOT-tests.jar>
to /home/jenkins/jenkins-slave/maven-repositories/1/org/apache/usergrid/persistence/2.2.0-SNAPSHOT/persistence-2.2.0-SNAPSHOT-tests.jar
[INFO] 
[INFO] --- jacoco-maven-plugin:0.7.5.201505241946:prepare-agent (default-prepare-agent) @
persistence ---
[INFO] argLine set to -javaagent:/home/jenkins/jenkins-slave/maven-repositories/1/org/jacoco/org.jacoco.agent/0.7.5.201505241946/org.jacoco.agent-0.7.5.201505241946-runtime.jar=destfile=<https://builds.apache.org/job/usergrid-stack/ws/stack/corepersistence/target/jacoco.exec>
[INFO] 
[INFO] --- jacoco-maven-plugin:0.7.5.201505241946:report (default-report) @ persistence ---
[INFO] Skipping JaCoCo execution due to missing execution data <https://builds.apache.org/job/usergrid-stack/ws/stack/corepersistence/target/jacoco.exec>
[INFO] 
[INFO] --- maven-jar-plugin:2.4:test-jar (default) @ persistence ---
[WARNING] JAR will be empty - no content was marked for inclusion!
[INFO] 
[INFO] --- jacoco-maven-plugin:0.7.5.201505241946:check (default-check) @ persistence ---
[INFO] Skipping JaCoCo execution due to missing execution data <https://builds.apache.org/job/usergrid-stack/ws/stack/corepersistence/target/jacoco.exec>
[INFO] 
[INFO] --- maven-install-plugin:2.4:install (default-install) @ persistence ---
[INFO] Installing <https://builds.apache.org/job/usergrid-stack/ws/stack/corepersistence/pom.xml>
to /home/jenkins/jenkins-slave/maven-repositories/1/org/apache/usergrid/persistence/2.2.0-SNAPSHOT/persistence-2.2.0-SNAPSHOT.pom
[INFO] Installing <https://builds.apache.org/job/usergrid-stack/ws/stack/corepersistence/target/persistence-2.2.0-SNAPSHOT-tests.jar>
to /home/jenkins/jenkins-slave/maven-repositories/1/org/apache/usergrid/persistence/2.2.0-SNAPSHOT/persistence-2.2.0-SNAPSHOT-tests.jar
[INFO] Installing <https://builds.apache.org/job/usergrid-stack/ws/stack/corepersistence/target/persistence-2.2.0-SNAPSHOT-tests.jar>
to /home/jenkins/jenkins-slave/maven-repositories/1/org/apache/usergrid/persistence/2.2.0-SNAPSHOT/persistence-2.2.0-SNAPSHOT-tests.jar
[INFO] 
[INFO] --- maven-deploy-plugin:2.7:deploy (default-deploy) @ persistence ---
[INFO] ------------------------------------------------------------------------
[INFO] Reactor Summary:
[INFO] 
[INFO] Usergrid Parent 2.2.0-SNAPSHOT ..................... SUCCESS [ 21.856 s]
[INFO] Usergrid Build Tools ............................... SUCCESS [ 22.935 s]
[INFO] Usergrid Config .................................... SUCCESS [ 16.813 s]
[INFO] Usergrid Persistence ............................... FAILURE [  3.214 s]
[INFO] Usergrid Model ..................................... SKIPPED
[INFO] Usergrid Common .................................... SKIPPED
[INFO] Usergrid ActorSystem ............................... SKIPPED
[INFO] Usergrid Collection ................................ SKIPPED
[INFO] Usergrid Map ....................................... SKIPPED
[INFO] Usergrid Queue ..................................... SKIPPED
[INFO] Usergrid QueryIndex ................................ SKIPPED
[INFO] Usergrid Test Utils ................................ SKIPPED
[INFO] Usergrid Graph ..................................... SKIPPED
[INFO] Usergrid Cache ..................................... SKIPPED
[INFO] Usergrid Token ..................................... SKIPPED
[INFO] Usergrid Core ...................................... SKIPPED
[INFO] Usergrid Services .................................. SKIPPED
[INFO] Usergrid REST ...................................... SKIPPED
[INFO] Usergrid Tools ..................................... SKIPPED
[INFO] Usergrid Query Validator 2.2.0-SNAPSHOT ............ SKIPPED
[INFO] ------------------------------------------------------------------------
[INFO] BUILD FAILURE
[INFO] ------------------------------------------------------------------------
[INFO] Total time: 01:51 min
[INFO] Finished at: 2019-04-07T07:52:37Z
[INFO] ------------------------------------------------------------------------
Waiting for Jenkins to finish collecting data
[ERROR] Failed to execute goal org.apache.maven.plugins:maven-deploy-plugin:2.7:deploy (default-deploy)
on project persistence: Deployment failed: repository element was not specified in the POM
inside distributionManagement element or in -DaltDeploymentRepository=id::layout::url parameter
-> [Help 1]
[ERROR] 
[ERROR] To see the full stack trace of the errors, re-run Maven with the -e switch.
[ERROR] Re-run Maven using the -X switch to enable full debug logging.
[ERROR] 
[ERROR] For more information about the errors and possible solutions, please read the following
articles:
[ERROR] [Help 1] http://cwiki.apache.org/confluence/display/MAVEN/MojoExecutionException
[ERROR] 
[ERROR] After correcting the problems, you can resume the build with the command
[ERROR]   mvn <goals> -rf :persistence
[JENKINS] Archiving <https://builds.apache.org/job/usergrid-stack/ws/stack/tools/pom.xml>
to org.apache.usergrid/usergrid-tools/2.2.0-SNAPSHOT/usergrid-tools-2.2.0-SNAPSHOT.pom
[JENKINS] Archiving <https://builds.apache.org/job/usergrid-stack/ws/stack/corepersistence/collection/pom.xml>
to org.apache.usergrid/collection/2.2.0-SNAPSHOT/collection-2.2.0-SNAPSHOT.pom
[Fast Archiver] No prior successful build to compare, so performing full copy of artifacts
[JENKINS] Archiving <https://builds.apache.org/job/usergrid-stack/ws/stack/corepersistence/queue/pom.xml>
to org.apache.usergrid/queue/2.2.0-SNAPSHOT/queue-2.2.0-SNAPSHOT.pom
[Fast Archiver] No prior successful build to compare, so performing full copy of artifacts
[JENKINS] Archiving <https://builds.apache.org/job/usergrid-stack/ws/stack/corepersistence/token/pom.xml>
to org.apache.usergrid/token/2.2.0-SNAPSHOT/token-2.2.0-SNAPSHOT.pom
[Fast Archiver] No prior successful build to compare, so performing full copy of artifacts
[JENKINS] Archiving <https://builds.apache.org/job/usergrid-stack/ws/stack/query-validator/pom.xml>
to org.apache.usergrid/usergrid-query-validator/2.2.0-SNAPSHOT/usergrid-query-validator-2.2.0-SNAPSHOT.pom
[Fast Archiver] No prior successful build to compare, so performing full copy of artifacts
[JENKINS] Archiving <https://builds.apache.org/job/usergrid-stack/ws/stack/corepersistence/graph/pom.xml>
to org.apache.usergrid/graph/2.2.0-SNAPSHOT/graph-2.2.0-SNAPSHOT.pom
[Fast Archiver] No prior successful build to compare, so performing full copy of artifacts
[JENKINS] Archiving <https://builds.apache.org/job/usergrid-stack/ws/stack/rest/pom.xml>
to org.apache.usergrid/usergrid-rest/2.2.0-SNAPSHOT/usergrid-rest-2.2.0-SNAPSHOT.pom
[JENKINS] Archiving <https://builds.apache.org/job/usergrid-stack/ws/stack/corepersistence/queryindex/pom.xml>
to org.apache.usergrid/queryindex/2.2.0-SNAPSHOT/queryindex-2.2.0-SNAPSHOT.pom
[Fast Archiver] No prior successful build to compare, so performing full copy of artifacts
[JENKINS] Archiving <https://builds.apache.org/job/usergrid-stack/ws/stack/build-tools/pom.xml>
to org.apache.usergrid/build-tools/2.2.0-SNAPSHOT/build-tools-2.2.0-SNAPSHOT.pom
[JENKINS] Archiving <https://builds.apache.org/job/usergrid-stack/ws/stack/build-tools/target/build-tools-2.2.0-SNAPSHOT.jar>
to org.apache.usergrid/build-tools/2.2.0-20190407.075125-1/build-tools-2.2.0-20190407.075125-1.jar
[JENKINS] Archiving <https://builds.apache.org/job/usergrid-stack/ws/stack/build-tools/target/build-tools-2.2.0-SNAPSHOT-tests.jar>
to org.apache.usergrid/build-tools/2.2.0-20190407.075125-1/build-tools-2.2.0-20190407.075125-1-tests.jar
[JENKINS] Archiving <https://builds.apache.org/job/usergrid-stack/ws/stack/corepersistence/actorsystem/pom.xml>
to org.apache.usergrid/actorsystem/2.2.0-SNAPSHOT/actorsystem-2.2.0-SNAPSHOT.pom
[Fast Archiver] No prior successful build to compare, so performing full copy of artifacts
[JENKINS] Archiving <https://builds.apache.org/job/usergrid-stack/ws/stack/pom.xml>
to org.apache.usergrid/usergrid/2.2.0-SNAPSHOT/usergrid-2.2.0-SNAPSHOT.pom
[JENKINS] Archiving <https://builds.apache.org/job/usergrid-stack/ws/stack/target/usergrid-2.2.0-SNAPSHOT-tests.jar>
to org.apache.usergrid/usergrid/2.2.0-20190407.075101-1/usergrid-2.2.0-20190407.075101-1-tests.jar
[JENKINS] Archiving <https://builds.apache.org/job/usergrid-stack/ws/stack/corepersistence/model/pom.xml>
to org.apache.usergrid/model/2.2.0-SNAPSHOT/model-2.2.0-SNAPSHOT.pom
[Fast Archiver] No prior successful build to compare, so performing full copy of artifacts
[JENKINS] Archiving <https://builds.apache.org/job/usergrid-stack/ws/stack/corepersistence/map/pom.xml>
to org.apache.usergrid/map/2.2.0-SNAPSHOT/map-2.2.0-SNAPSHOT.pom
[Fast Archiver] No prior successful build to compare, so performing full copy of artifacts
[JENKINS] Archiving <https://builds.apache.org/job/usergrid-stack/ws/stack/services/pom.xml>
to org.apache.usergrid/usergrid-services/2.2.0-SNAPSHOT/usergrid-services-2.2.0-SNAPSHOT.pom
[JENKINS] Archiving <https://builds.apache.org/job/usergrid-stack/ws/stack/config/pom.xml>
to org.apache.usergrid/usergrid-config/2.2.0-SNAPSHOT/usergrid-config-2.2.0-SNAPSHOT.pom
[JENKINS] Archiving <https://builds.apache.org/job/usergrid-stack/ws/stack/config/target/usergrid-config-2.2.0-SNAPSHOT.jar>
to org.apache.usergrid/usergrid-config/2.2.0-20190407.075150-1/usergrid-config-2.2.0-20190407.075150-1.jar
[JENKINS] Archiving <https://builds.apache.org/job/usergrid-stack/ws/stack/config/target/usergrid-config-2.2.0-SNAPSHOT-tests.jar>
to org.apache.usergrid/usergrid-config/2.2.0-20190407.075150-1/usergrid-config-2.2.0-20190407.075150-1-tests.jar
[JENKINS] Archiving <https://builds.apache.org/job/usergrid-stack/ws/stack/corepersistence/cache/pom.xml>
to org.apache.usergrid/cache/2.2.0-SNAPSHOT/cache-2.2.0-SNAPSHOT.pom
[Fast Archiver] No prior successful build to compare, so performing full copy of artifacts
[JENKINS] Archiving <https://builds.apache.org/job/usergrid-stack/ws/stack/corepersistence/common/pom.xml>
to org.apache.usergrid/common/2.2.0-SNAPSHOT/common-2.2.0-SNAPSHOT.pom
[Fast Archiver] No prior successful build to compare, so performing full copy of artifacts
[JENKINS] Archiving <https://builds.apache.org/job/usergrid-stack/ws/stack/core/pom.xml>
to org.apache.usergrid/usergrid-core/2.2.0-SNAPSHOT/usergrid-core-2.2.0-SNAPSHOT.pom
[JENKINS] Archiving <https://builds.apache.org/job/usergrid-stack/ws/stack/corepersistence/pom.xml>
to org.apache.usergrid/persistence/2.2.0-SNAPSHOT/persistence-2.2.0-SNAPSHOT.pom
[JENKINS] Archiving <https://builds.apache.org/job/usergrid-stack/ws/stack/corepersistence/target/persistence-2.2.0-SNAPSHOT-tests.jar>
to org.apache.usergrid/persistence/2.2.0-SNAPSHOT/persistence-2.2.0-SNAPSHOT-tests.jar
[Fast Archiver] No prior successful build to compare, so performing full copy of artifacts
[JENKINS] Archiving <https://builds.apache.org/job/usergrid-stack/ws/stack/test-utils/pom.xml>
to org.apache.usergrid/usergrid-test-utils/2.2.0-SNAPSHOT/usergrid-test-utils-2.2.0-SNAPSHOT.pom
channel stopped

Mime
View raw message